Version 4
SHEET 1 1552 2252
WIRE 384 -80 368 -80
WIRE 384 176 368 176
WIRE 160 256 160 192
WIRE -464 272 -464 240
WIRE 384 272 368 272
WIRE -464 384 -464 352
WIRE -464 512 -464 480
WIRE 384 528 368 528
WIRE 160 608 160 544
WIRE 384 624 368 624
WIRE -464 640 -464 592
WIRE 384 880 368 880
WIRE 160 960 160 896
WIRE 384 976 368 976
WIRE 384 1232 368 1232
WIRE 160 1312 160 1248
WIRE 384 1328 368 1328
WIRE 384 1584 368 1584
WIRE 160 1664 160 1600
WIRE 192 1664 160 1664
FLAG -464 240 Rst
FLAG -464 480 Clk
FLAG -464 640 0
FLAG -464 384 0
FLAG 48 -16 Q0
FLAG 464 48 Q0
FLAG 160 -176 0
FLAG -32 112 0
FLAG 48 336 Q1
FLAG 464 400 Q1
FLAG -32 464 0
FLAG 48 688 Q2
FLAG 464 752 Q2
FLAG -32 816 0
FLAG 48 1040 Q3
FLAG 464 1104 Q3
FLAG -32 1168 0
FLAG 48 1392 Q4
FLAG 464 1456 Q4
FLAG -32 1520 0
FLAG 192 1664 C_out
FLAG 384 -80 Clk
FLAG 384 272 Clk
FLAG 384 624 Clk
FLAG 384 1328 Clk
FLAG 384 976 Clk
FLAG 384 1584 Rst
FLAG 384 1232 Rst
FLAG 384 880 Rst
FLAG 384 528 Rst
FLAG 384 176 Rst
SYMBOL Full_Adder 192 48 R0
WINDOW 0 15 -66 Bottom 2
SYMATTR InstName X1
SYMBOL D_FF_R 368 48 R0
SYMATTR InstName X2
SYMBOL voltage -464 256 R0
WINDOW 123 0 0 Left 0
WINDOW 39 0 0 Left 0
SYMATTR InstName Vrst
SYMATTR Value PULSE(1 0 3n 1p 1p 1u 1u)
SYMBOL voltage -464 496 R0
WINDOW 123 0 0 Left 0
WINDOW 39 0 0 Left 0
SYMATTR InstName Vclk
SYMATTR Value PULSE(0 1 1n 1p 1p 1n 2n)
SYMBOL voltage 64 112 R90
WINDOW 123 0 0 Left 0
WINDOW 39 0 0 Left 0
WINDOW 0 -50 38 VRight 2
WINDOW 3 53 53 VRight 2
SYMATTR InstName Vdd
SYMATTR Value 1
SYMBOL voltage 160 -80 R180
WINDOW 0 24 96 Left 2
WINDOW 3 24 16 Left 2
SYMATTR InstName Vc_in
SYMATTR Value 0
SYMBOL Full_Adder 192 400 R0
WINDOW 0 15 -66 Bottom 2
SYMATTR InstName X11
SYMBOL D_FF_R 368 400 R0
SYMATTR InstName X12
SYMBOL voltage 64 464 R90
WINDOW 123 0 0 Left 0
WINDOW 39 0 0 Left 0
WINDOW 0 -51 30 VRight 2
WINDOW 3 54 -7 VRight 2
SYMATTR InstName Vdd1
SYMATTR Value PWL(7n 0 13n 1 19n 0)
SYMBOL Full_Adder 192 752 R0
WINDOW 0 15 -66 Bottom 2
SYMATTR InstName X13
SYMBOL D_FF_R 368 752 R0
SYMATTR InstName X14
SYMBOL voltage 64 816 R90
WINDOW 123 0 0 Left 0
WINDOW 39 0 0 Left 0
WINDOW 0 -47 30 VRight 2
WINDOW 3 52 50 VRight 2
SYMATTR InstName Vdd2
SYMATTR Value 0
SYMBOL Full_Adder 192 1104 R0
WINDOW 0 15 -66 Bottom 2
SYMATTR InstName X15
SYMBOL D_FF_R 368 1104 R0
SYMATTR InstName X16
SYMBOL voltage 64 1168 R90
WINDOW 123 0 0 Left 0
WINDOW 39 0 0 Left 0
WINDOW 0 -53 28 VRight 2
WINDOW 3 54 -7 VRight 2
SYMATTR InstName Vdd3
SYMATTR Value PWL(13n 0 19n 1)
SYMBOL Full_Adder 192 1456 R0
WINDOW 0 15 -66 Bottom 2
SYMATTR InstName X17
SYMBOL D_FF_R 368 1456 R0
SYMATTR InstName X18
SYMBOL voltage 64 1520 R90
WINDOW 123 0 0 Left 0
WINDOW 39 0 0 Left 0
WINDOW 0 -53 23 VRight 2
WINDOW 3 57 46 VRight 2
SYMATTR InstName Vdd4
SYMATTR Value 0
TEXT -536 728 Left 2 !.include cmosedu_models.txt
TEXT -536 752 Left 2 !.tran 23n
