
Fonctionnalites
---------------

Le programme n'est pas fonctionnel.
Le module Argparse est absent.

Style de programmation
----------------------

Pas de commentaires

Amélioration
------------

__________________________