-------------------------------------------------------------------------------
Test set: edu.upc.mpi.logicschemaRGD.LogicSchemaRGDTest
-------------------------------------------------------------------------------
Tests run: 2, Failures: 0, Errors: 0, Skipped: 0, Time elapsed: 0.405 sec
