<?xml version="1.0" encoding="UTF-8"?>
<svg version="1.1" viewBox="-10 -10 820 820" xmlns="http://www.w3.org/2000/svg">
<circle r="410" cx="400" cy="400" fill="#ffffff"/>
<path d="m354.21 330.41c-4.5778-31.06-126.61-103.6-130.89-147.36 2.7263-38.854 13.965-149.04 21.681-151.61 7.3617-2.4521 75.78-31.354 155-31.44 76.978-0.08408 127.45 18.412 185.51 45.956-4.1081 58.709-21.548 239.72-82.786 283.99-16.948 0.31904-125.17 0.94743-148.51 0.459z" fill="#a595a7"/>
<path d="m267.82 347.85 66.548 2.1126 83.833 1.3315 110.25-1.5216 79.269-5.7065-4.4066 296.25-1.1424 12.852-7.4502 5.8478-39.025 13.998-73.48 11.578-79.879-1.9399-93.012-14.234c-31.215-14.771-23.767-23.325-42.22-50.376l-3.1177-171.13z" fill="#fdc200"/>
<path d="m474.07 681.81c18.076-0.998 30.904-2.202 46.313-4.347 27.504-3.828 50.132-9.83 66.49-17.633 5.4-2.577 6.13-3.14 8.32-6.413 3.157-4.72 5.1-9.522 6.112-15.1-37.483 146.07-472.48 61.424-530.21-26.954-7.8807-12.065-29.103-252.71-28.747-255.19 2.5996-18.12 195.52-10.901 202.15-11.645 8.1546-0.91623 16.585 2.0846 25.319 3.3171-0.5385 8.8168-1.005 17.934-1.4019 27.446-0.39686 9.512-0.72408 19.419-0.98401 29.816-0.51987 20.794-0.96158 89.406-0.96208 114.88-2e-3 56.922 1.16 88.074 3.656 98.028 3.428 13.672 12.192 24.994 26.85 34.682 26.2 17.317 71.558 27.623 130.71 29.7 7.454 0.26 38.017-0.127 46.39-0.59z" fill="#dba500"/>
<path d="m172.78 71.663c17.155-15.809 70.754-40.14 72.148-40.14 0.233 0 1.404 1.476 2.603 3.28s5.66 7.962 9.913 13.684l10.3 14.084c10.14 14.6 14.21 25.245 12.916 33.762-1.147 7.54-6.077 15.833-16.264 27.355-1.49 1.684-6.178 6.735-10.42 11.224-14.38 15.215-16.9 18.176-21.68 25.382-6.8 10.275-8.353 17.636-5.76 27.3 4.8 17.914 15.807 31.178 34.76 41.923 6.583 3.732 14.587 7.42 29.28 13.49 17.626 7.282 26.422 11.41 33.545 15.74 5.005 3.043 10.552 7.148 13.525 10.012 5.03 4.843 9.228 13.935 12.77 27.652 2.143 8.3 3.967 22.224 3.862 29.477l-0.066 4.518 6.5 0.217c33.826 1.132 97.494 1.094 133.44-0.08 3.996-0.13 7.362-0.333 7.48-0.45s0.91-2.416 1.76-5.108c1.986-6.29 5.735-17.393 6.817-20.2 2.44-6.304 4.276-8.613 16.35-20.556 7.137-7.06 8.373-8.436 10.5-11.684 3.133-4.786 6.343-10.982 7.462-14.404 0.8-2.445 0.9-3.176 0.895-7.202 6e-3 -5.2-0.43-6.88-2.917-11.203-2.164-3.764-4.412-6.445-10.196-12.164-6.31-6.237-8.41-8.583-10.396-11.605-2.014-3.065-2.94-5.89-2.952-9-0.023-5.75 2.438-10.26 10.323-18.917 7.37-8.092 9.77-11.435 11.253-15.685 0.968-2.773 1.058-8.533 0.174-11.203-1.065-3.216-2.75-6.197-5.97-10.563-7.025-9.527-8.43-11.9-9.472-15.99-2.393-9.398 4.562-22.157 19.17-35.163 2.14-1.907 7.354-6.355 11.582-9.886 11.51-9.6 15.395-13.293 20.194-19.145 5.37-6.55 8.574-14.576 8.793-22.037 0.037-1.27 0.216-2.248 0.425-2.33 0.414-0.16 5.257 2.4 13.296 7 20.68 11.862 30.227 17.811 48.097 33.031 0.9931 30.625-16.473 65.59-34.043 84.205-13.073 13.85 18.2 21.325 16.5 36.957-3.3262 30.587-31.209 70.387-52.362 96.06-33.152 40.236-133.57 46.05-250.05 25.813-15.041-2.6132 1.9836-25.41-43.281-39.537-39.23-12.244-81.256-15.694-112.08-30.019-10.09-4.6892-33.963-21.934-36.389-26.015-25.382-42.693 13.832-81.823 33.229-114.49 10.711-18.04 2.5562-35.021 4.4339-47.389z" fill="#634769"/>
<path d="m90.278 652.19c-44.78-54.892-74.145-120.74-84.945-190.47-2.206-14.244-4.185-34.553-4.398-45.134l-0.06-3.04-0.183 2.24c-0.354 4.327-0.715-15.733-0.448-24.887 0.17-5.845 0.33-8.25 0.448-6.802l0.183 2.24 0.06-3.04c0.213-10.58 2.192-30.89 4.398-45.134 14.972-96.67 65.44-184.82 141.56-247.29 9.168-7.522 25.12-19.437 25.755-19.237 0.72 0.226 3.043 10.26 3.702 15.985 1.268 11.01-1.568 22.857-9.057 37.84-3.087 6.176-5.118 9.65-12.354 21.126-9.327 14.792-11.9 19.2-15.384 26.248-6.688 13.57-9.41 24.07-9.414 36.33-2e-3 4.937 0.117 6.48 0.718 9.283 3.498 16.33 15.7 28.058 38.914 37.37 12.836 5.15 23.798 8.205 57.682 16.073 27.027 6.275 39.104 9.502 50.152 13.4 8.5236 4.6188 29.34 11.436 34.85 20.8-22.344 1.1549-52.01 1.2161-73.726 8.2215-7.29 2.48-11.358 6.45-12.48 12.178-0.934 4.77 1.553 10 6.175 12.988 1.93 1.247 6.143 2.975 9.822 4.027l2.08 0.595 0.256 2.392c0.70724 9.3004 0.25632 18.267-3.3661 25.23-2.8535 5.4849-7.6751 9.7261-15.449 11.907-3.35 0.876-5.317 0.874-31.198-0.03-17.59-0.614-21.602-0.67-24.96-0.35-29.4 2.807-56.34 22.947-70.37 52.607-6.2 13.126-9.493 26.45-10.24 41.557-0.9 18.192 2.38 36.37 10.077 55.883 4.926 12.485 10.8 23.02 17.765 31.863 3.086 3.917 9.964 10.795 13.754 13.755 9.185 7.17 19.933 12.375 31.613 15.306 10.692 2.683 20.21 3.733 42.28 4.663 17.972 0.757 22.848 1.335 27.04 3.203 4.902 2.185 7.068 5.56 7.972 12.423 0.518 3.934 1 5.164 2.786 7.102 1.583 1.718 2.692 2.366 4.92 2.876l1.6 0.366 0.233 5.738c0.4 9.84 1.723 15.035 5.368 21.08 6.138 10.18 15.16 17.784 29.277 24.678 24.617 12.02 60.325 19.107 110.71 21.975 9.787 0.557 47.605 0.563 57.597 0.01 61.496-3.406 102.98-12.93 127.67-29.31 9.345-6.2 17.463-15.254 20.32-22.663 2.46-6.378 2.83-11.006 2.865-35.64l4.248-262.13c0.086-4.445 0.088-4.455 0.886-4.688 7.835-2.283 12.016-5.4381 14.692-8.3111 6.152-6.58 3.3417-14.837-5.2983-19.432-6.64-3.53-23.66-6.536-50.35-8.9-3.253-0.287-5.974-0.58-6.045-0.652-0.476-0.476 3.443-3.4 10.2-7.584 6.853-4.253 8.67-5.57 11.402-8.268 3.567-3.522 4.9-6.87 4.273-10.726-0.414-2.545-0.74-3.45-3.258-9.084-1.217-2.72-2.492-5.96-2.835-7.196-1.318-4.76-0.533-8.798 2.506-12.88 3.56-4.78 7.57-7.9 20.07-15.563 12.47-7.654 17.74-12.368 20.83-18.63 3.18-6.445 3.033-11.602-0.488-17.052-0.68-1.052-3.57-4.344-6.422-7.315-5.592-5.826-7.95-8.855-8.914-11.442-1.77-4.756-0.866-9.84 2.853-16.056 1.862-3.113 4.144-6.067 10.145-13.13 7.908-9.308 12.945-17.626 17.342-28.634 4.417-11.06 6.647-21.192 7.556-34.33 0.106-1.54 0.333-2.8 0.504-2.8 0.328 0 6.902 5.295 12.27 9.884 16.128 13.784 32.37 30.096 45.94 46.137 50.094 59.213 81.615 130.92 91.312 207.74 1.325 10.498 2.647 26.4 2.792 33.6l0.06 3.04 0.183-2.24c0.354-4.327 0.715 15.733 0.448 24.887-0.17 5.845-0.33 8.25-0.448 6.802l-0.183-2.24-0.06 3.04c-0.213 10.58-2.192 30.89-4.398 45.134-14.14 91.292-60.026 175.25-129.57 237.06-181.58 142.04-418.58 139.61-574.82-46.574zm157.57-66.904c-0.388-0.628-4.835-3.448-7.68-4.872-5.005-2.503-10.82-4.358-18.234-5.817-1.408-0.277-8.248-1.376-15.2-2.442-13.53-2.075-20.053-3.294-25.92-4.846-21.392-5.66-34.01-17.045-42.334-38.194-8.443-21.457-10.956-44.143-6.944-62.666 4.615-21.3 18.22-37.985 36.033-44.187 6.418-2.235 13.3-3.054 36.762-4.384 14.597-0.827 18.518-0.826 21.77 6e-3 7.893 2.02 14.505 7.83 17.268 15.173 1.774 4.714 1.652 2.835 2.728 42.122l0.635 22.887 1.42 57.777c0.478 18.408 0.57 29.77 0.237 29.77-0.22135-0.0199-0.42159-0.13951-0.544-0.325zm99.198-255.01-14.24-0.58c-20.997-0.85-46.945-3.4515-47.001-4.0545-0.07-0.77 6.6148-1.1715 15.482-2.2025 9.094-1.057 51.266-3.467 52.077-2.976 0.288 0.175 0.315 7.13 0.035 8.83l-0.198 1.2-1.958-0.063-4.198-0.156zm155.67-0.337c0-0.185 0.275-1.252 0.612-2.37l1.462-4.873 0.85-2.84 6.938 0.22 40.056 1.776c10.858 0.524 27.563 2.196 28.79 2.883 0.725 0.406-0.136 0.538-9.27 1.427-22.356 2.175-69.437 4.737-69.437 3.778zm-19.2-39.313c-5.23-1.424-8.447-4.293-10.627-9.484-1.74-4.14-2.394-11.898-1.4-16.586 0.5-2.3 3.54-10.904 4.663-13.134 1.543-3.067 5.556-8.623 8.47-11.726 2.5-2.66 3.478-3.462 5.377-4.4 2.176-1.076 2.513-1.147 5.36-1.14 7.412 0.017 12.532 4.116 14.43 11.554 0.675 2.645 0.762 3.67 0.73 8.605-0.033 5.197-0.11 5.878-1.044 9.425-1.208 4.582-3.495 10.362-5.233 13.224l-1.907 3.24c-1.63 2.936-3.77 5.158-8.462 8.79-2.33 1.803-7.018 2.543-10.355 1.634zm5.936-10.265c3.72-2.47 8.127-9.85 10.067-16.857 0.74-2.67 0.794-3.732 0.228-4.506-0.586-0.802-1.165-0.434-2.75 1.745-0.77 1.058-2.28 2.963-3.36 4.235-2.208 2.603-8.226 10.57-8.792 11.64-0.66 1.25-0.447 2.634 0.566 3.647 1.18 1.18 2.366 1.208 4.04 0.096zm-2.42-20.285c0.327-0.175 1.932-1.868 3.567-3.76 1.7498-2.0231 3.53-4.0197 5.34-5.989 1.303-1.4 2.517-2.87 2.697-3.268 0.714-1.568-1.835-3.59-4-3.183-1.507 0.283-3.604 2.194-5.642 5.143-2.63 3.805-5.18 9.68-4.723 10.872 0.22 0.574 1.842 0.683 2.77 0.186zm-91.032 28.072c-0.528-0.17-3.336-0.404-6.24-0.52-6.127-0.245-6.92-0.528-8.086-2.9-0.682-1.386-0.72-1.9-0.873-12.17-0.11-7.304-0.28-10.927-0.533-11.363-0.537-0.923-2.03-2.248-3.194-2.835-1.785-0.9-3.66-1.158-10.833-1.493-14.273-0.666-14.696-0.994-16.484-12.797-0.85-5.615-1.176-11.793-0.672-12.736 0.57-1.064 5.866-4.456 7.95-5.09 2.1-0.637 8.5-0.76 14.673-0.283 2.267 0.37536 3.2978 0.50285 4.906-0.95 2.593-2.344 3.1-4.007 4.654-14.975 0.56-3.99 0.91-5.558 1.345-6.047 0.615-0.692 4.12-2.5 4.853-2.5 0.234 0 1.417-0.435 2.628-0.967 3.746-1.645 9.928-1.9 13.135-0.543 2.365 1 2.84 2.268 4.128 11l1.3 8.05c0.506 2.267 1.713 4.057 3.69 5.472 2.632 1.885 4.904 2.314 13.597 2.564 6.257 0.18 7.353 0.288 8.16 0.8 3.043 1.934 3.652 3.544 3.652 9.647 0 2.32-0.145 4.987-0.323 5.924-0.368 1.944-0.093 2.488 0.935 1.85 0.95-0.59 1.3 0.03 1.296 2.294-6e-3 5.2-2.415 6.303-15.697 7.186-7 0.465-9.63 0.798-11.72 1.482-1.416 0.464-3.78 3.184-4.367 5.025-0.81 2.546-1.242 9.014-0.996 14.97 0.215 5.204 0.192 5.535-0.5 7.12-0.93 2.164-2.7 3.755-4.865 4.348-2.3 0.636-4.383 0.796-5.533 0.425zm-123.51-72.15c-2.765-0.367-4.194-1.05-6.194-2.96-1.9494-1.8981-2.5466-4.1765-3.234-6.548-0.422-1.313-0.132-3.466 0.803-5.956l0.954-2.56c1.816-4.903 8.9908-15.948 12.456-18.54 5.9884-6.0494 12.514-10.681 16.091-15.506 3.47-4.75 3.877-5.683 4.125-9.462 0.12-1.828 3e-3 -2.88-0.508-4.564-0.574-1.89-0.836-2.296-1.928-2.986-0.83-0.524-1.726-0.798-2.61-0.798-1.858 0-5.06 0.607-6.025 1.14-0.44 0.244-1.376 0.72-2.08 1.055s-3.236 1.897-5.627 3.468c-5.416 3.56-6.036 3.836-7.375 3.28-3.15-1.305-5.664-4.614-5.284-6.953 0.316-1.948 3.473-6.796 5.946-9.13 2.175-2.053 5.16-4.057 6.05-4.063 0.236-2e-3 0.78-0.28 1.21-0.616s1.603-0.853 2.6-1.147l3.75-1.123c4.28-1.314 8.943-1.614 12.48-0.803 5.917 1.357 11.08 5.44 13.774 10.89 3.13 6.332 3.107 15.17-0.064 24.487-1.51 4.44-2.2 5.75-4.695 8.803-2.905 4.0376-6.4869 6.6052-10.532 10.223-0.125 0.324-1.8685 1.58-3.6625 3.01-3.5 2.81-6.084 5.516-6.382 6.685-0.22 0.863 0.51 2.084 1.718 2.874 0.753 0.492 1.56 0.554 6.315 0.485 3-0.044 7.036-0.24 8.972-0.435 3.514-0.355 6.613-0.223 8.88 0.38 0.925 0.246 1.345 0.603 1.834 1.563 1.267 2.484 2.1 10.808 1.308 12.918-0.164 0.43-0.756 1.1-1.315 1.508-2.05 1.46-3.693 1.57-22.866 1.532l-18.88-0.164zm191.03-2.956c-0.704-0.326-3.224-2.354-5.6-4.507l-9.356-8.377c-4.982-4.416-7.177-6.806-7.43-8.093-0.474-2.407-0.462-2.903 0.106-4.148l1.106-2.498c1-2.335 8.277-5.6 15.254-6.843 2.184-0.39 5.264-0.567 10.935-0.63 8.26-0.092 8.697-0.134 12.168-1.165 2.667-0.793 4.684-2.484 5.88-4.93 0.86-1.757 0.86-1.764 0.285-3.038-0.427-0.948-1.078-1.584-2.523-2.468-2.02-1.235-3.552-1.66-8.98-2.488-1.756-0.268-3.504-0.69-3.884-0.94-1.662-1.09-1.642-5.655 0.03-6.75 2.482-1.627 8.566-2.25 12.05-1.237 3.36 0.978 8.655 3.838 10.574 5.712 3.197 3.122 4.978 8.612 4.126 12.714-1.166 5.615-6.12 11.13-13.223 14.722-3.073 1.555-5.647 1.924-13.3 1.91-3.75-7e-3 -6.966-0.104-7.145-0.215s-1.263-0.1-2.41 0.022c-3.25 0.348-4.22 1.91-2.476 3.984 0.84 0.998 4.618 4.25 8.475 7.293 1.158 0.914 2.504 2.236 2.99 2.94 0.802 1.158 0.85 1.382 0.52 2.39-0.473 1.434-3.186 5.297-4.49 6.396-1.2 1.002-1.943 1.052-3.684 0.246zm-116.47-33.699c-1.712-0.64-3.584-2.13-4.597-3.66-1.212-1.83-3.058-6.55-4.853-12.405-1.913-6.242-1.776-6.757 2.794-10.446 3.385-2.733 5.74-3.855 11.01-5.248 2.395-0.633 5.78-1.592 7.52-2.13 4.7937-0.52485 9.0002-2.661 12.66-3.677 12.153-3.35 26.848-8.358 34.022-11.592 5.338-2.406 7.837-2.83 10.785-1.824 3.187 1.086 5.67 4.382 7.703 10.226 1.745 5.016 1.97 6.484 1.36 8.873-1.325 5.187-3.37 6.442-19.97 12.258-12.754 4.468-36.262 13.114-45.315 16.666-6.763 2.654-8.32 3.153-10.08 3.228-1.144 0.05-2.512-0.073-3.04-0.27zm29.119-71.855c-5.566-1.408-10.007-3.486-12.424-5.814-4.013-3.866-7.057-9.838-8.273-16.234-0.947-4.98-1.023-14.462-0.15-18.65 0.792-3.8 5.1-15.956 7.057-19.912 2.635-5.327 7.305-12.083 11.946-17.285 3.642-4.082 7.354-7.362 8.33-7.362 0.168 0 0.65-0.26 1.07-0.58 1.98-1.505 7.565-2.34 11.3-1.688 5.115 0.89 10.302 3.337 12.695 5.986 1.828 2.023 4.192 5.347 4.782 6.725 0.872 2.035 2.467 8.512 2.7 11.003 0.657 6.74 0.186 15.25-1.15 20.806-2.4367 8.1757-5.1232 16.723-9.321 23.233-0.564 0.87-1.334 2.23-1.713 3.024-1.523 3.182-7.363 9.69-9.683 10.792-1.5682 1.3162-2.7969 2.6118-4.06 3.366-1.097 0.65-1.508 0.838-4.16 1.887-1.513 0.598-2.6 0.772-5.12 0.816-1.76 0.03-3.488-0.016-3.84-0.105zm6.173-16.089c3.507-1.813 10.088-10.982 13.078-18.22 3.47-8.398 4.496-14.976 2.443-15.654-0.44-0.145-0.558-0.012-3.517 3.958-1.198 1.607-3.297 4.27-4.665 5.922-3.422 4.128-4.44 5.434-6.825 8.762-1.2826 1.7819-2.5941 3.5428-3.934 5.282-2.73 3.508-3.23 4.443-3.232 6.044-3e-3 3.575 3.412 5.58 6.65 3.905zm-3.067-31.825c0.672-0.39 3.378-3.273 6.24-6.647l8.173-9.387c3.533-3.883 3.83-4.73 2.292-6.557-0.966-1.148-3.72-2.092-5.14-1.762-2.606 0.606-5.51 3.404-9.1 8.757-3.138 4.693-6.7 12.797-6.7 15.244 0 1.54 1.907 1.7 4.226 0.352zm131.61 47.602c-1.232-0.26-6.416-1.463-11.52-2.676l-32.638-7.326c-17.18-3.447-18.056-3.742-19.628-6.6-0.903-1.642-0.658-6.874 0.538-11.48 2.568-9.893 5.637-12.36 13.17-10.586 4.74 1.115 14.913 4.373 15.562 4.984 0.527 0.495 0.932 0.595 1.773 0.438 0.854-0.16 2.542 0.28 7.796 2.04 7.615 2.548 21.576 6.13 26.958 6.918 6.013 0.88 8.44 1.806 10.388 3.962 1.41 1.56 1.836 2.987 1.835 6.128 0 2.63-1.133 7.667-2.263 10.07-0.765 1.63-2.728 3.54-4.317 4.205-1.36 0.57-4.755 0.536-7.655-0.074zm-206.07-22.165c-3.1-1.996-3.466-2.456-3.244-4.077 0.25-1.826 1.56-4.633 4.125-8.846 2.247-3.69 2.99-5.902 2.694-8.032-0.1-0.73-1.123-3.67-2.27-6.53-2.556-6.373-3.13-8.3-3.004-10.072 0.093-1.288 0.238-1.478 2.34-3.054 1.232-0.924 2.514-1.68 2.85-1.68 1.016 0 2.74 1.565 4.188 3.803 1.97 3.044 2.445 3.387 4.537 3.276 0.957-0.05 2.32-1.496 4.42-4.687 1.928-2.93 2.92-3.672 4.904-3.672 1.357 0 5.74 1.987 6.027 2.73 0.222 0.578-0.757 2.704-3.228 7.01-2.695 4.696-5.23 9.893-5.483 11.24-0.396 2.1 0.756 5.38 3.7 10.476 0.686 1.192 1.7 2.77 2.23 3.504 1.43 1.944 1.307 2.753-0.706 4.693-2.047 1.972-3.765 3.27-4.076 3.078-0.75889 0.46293-1.4418 0.84371-2.2 0.934-1.59-0.343-2.28-0.886-3.2-2.535-1.224-2.17-2.647-3.357-4.023-3.357-1.133 0-1.22 0.073-4.287 3.64-1.646 1.913-3.408 3.405-4.018 3.4-0.186-2e-3 -1.202-0.56-2.258-1.24zm214.23-15.39-6.24-1.408c-6.48-1.687-26.737-6.283-34.878-7.914-17.52-3.5-19.477-4.14-20.792-6.682-1.236-2.4-0.77-7.955 1.182-14.098 2.965-9.335 5.487-10.253 18.096-6.584 8.1 2.36 9.07 2.693 9.866 3.426 0.525 0.483 0.947 0.576 1.92 0.424 0.982-0.154 2.025 0.084 4.904 1.12 8.185 2.944 23.485 6.966 29.844 7.846 6.976 0.965 10.203 2.65 11.63 6.067 1.117 2.678 0.22 9.796-1.764 14.02-0.797 1.695-2.74 3.605-4.352 4.28s-4.604 0.515-9.415-0.497z" fill="#45244d"/>
<path d="m247.71 616.73c-0.808-0.81-0.92-1.193-1.132-3.92-0.83-10.626-5.377-16.722-14.833-19.887-5.53-1.85-11.146-2.626-27.407-3.787-19.496-1.392-27.133-2.48-37.24-5.314-19.025-5.33-33.87-16.504-44.366-33.4-8.35-13.432-15.256-33.144-17.79-50.76-0.83-5.775-1.177-20.082-0.623-25.643 1.634-16.377 6.52-30.755 14.67-43.178 3.308-5.042 5.825-8.172 10.132-12.6 10.827-11.13 23.18-17.94 37.617-20.74 5.84-1.133 26.42-0.697 55.837 1.182l11.3 0.816c4.364 0.57 5.313 6.344 1.306 7.947-1.18 0.473-2.173 0.476-11.753 0.036-26.373-1.21-47.068-1.468-52.7-0.654-22.97 3.316-43.316 22.497-51.837 48.864-7.203 22.288-5.215 48.9 5.676 75.98 5.668 14.094 12.586 24.164 21.965 31.975 7.37 6.137 17.313 10.898 28.8 13.786 49.112 8.2317 73.709 2.9181 76.405 34.372 0.237 3.615-0.075 4.865-1.36 5.45-1.197 0.546-1.687 0.447-2.67-0.535zm192.14-18.027c-1.403-0.226-2.856-1.73-3.206-3.32-0.117-0.53-0.264-3.222-0.327-5.985s-0.27-5.603-0.462-6.31c-0.546-2.027-1-11.817-1.24-26.597-0.236-14.732-0.243-14.78-2.043-16.115-0.75-0.554-1.576-0.68-5.76-0.87-5.493-0.25-7.144-0.594-8.544-1.772-1.138-0.958-1.498-2.14-1.84-6.05-0.314-3.59-0.23-4.296 0.628-5.212 0.97-1.038 4.547-2.757 6.97-3.35 6.262-1.53 7.302-1.703 14.06-2.328 8.716-0.807 16.416-1.214 23.52-1.245l6.72-0.03 1.674 0.883c2.67 1.408 2.79 1.737 2.91 8.096 0.092 4.8 0.032 5.64-0.48 6.71-0.906 1.89-1.915 2.457-4.635 2.608-11.732 0.652-12.36 0.8-13.55 3.16-0.625 1.24-0.64 1.91-0.64 28.013 0 24.93-0.038 26.8-0.56 27.597-0.308 0.47-0.884 1.03-1.28 1.242-1.256 0.675-9.433 1.277-11.916 0.877zm-44.938-1.78c-2.343-1.243-2.404-1.485-2.583-10.182-0.156-7.615-0.177-7.813-0.905-8.588-0.98-1.042-2.016-1.17-6.615-0.812-4.664 0.363-9.287 1.27-11.198 2.194-1.943 0.94-2.657 2.256-3.368 6.2-1.088 6.038-2.145 9.63-3 10.202-0.425 0.284-8.05 0.317-9.084 0.04-0.403-0.108-0.976-0.646-1.273-1.196-0.797-1.474-0.936-11.073-0.262-18.07l1.455-15.95c0.0375-0.43413 0.0832-0.88934 0.13616-1.3601 0.65173-5.5231 2.0904-11.617 3.057-16.531 1.1103-4.7837 3.2913-9.2085 6.0008-13.194 2.2941-2.9735 5.5567-5.6914 8.3568-7.4441 4.2129-2.3176 8.4698-2.6103 11.451-2.7499 7.372-0.333 11.563 0.79 15.322 4.1 3.72 3.276 6.987 9.238 7.7 14.07 0.972 6.502 1.132 10.74 0.786 20.757-1 28.95-1.97 37.062-4.6 38.472-0.396 0.212-2.73 0.423-5.49 0.497-4.182 0.11-4.94 0.053-5.897-0.454zm-2.214-34.92c0.754-0.468 1.355-1.194 1.698-2.05 1.56-3.9 1.016-16.076-0.884-19.786-1.44-2.813-5.053-4.118-8.867-3.202-1.295 0.31-2.082 0.798-3.624 2.245-2.954 2.77-4.1 5.144-5.436 11.358-1.473 6.798-1.674 8.71-1.067 10.164 0.464 1.11 0.54 1.15 2.665 1.38 5.455 0.59 7.542 0.718 10.827 0.67 3.045-0.045 3.677-0.15 4.687-0.776zm-49.646 34.818c-0.264-0.17 0 0-1.22-0.315-2.2644-0.15565-4.0471-0.11956-6.0004-0.6034-2.201-0.36511-4.0826-0.9556-4.4936-3.1496-0.238-1.27 0.237-6.958 1.358-16.258 0.46999-5.4533 1.5259-11.232 1.7052-16.038 0.0234-0.75134-0.23782-0.75344-0.74145-1.0279-0.0464-5e-3 -0.0929-8e-3 -0.13943-8e-3 -0.0465-3.1e-4 -0.093 2e-3 -0.13919 6e-3 -0.0462 4e-3 -0.0923 0.011-0.13789 0.0199-0.0456 9e-3 -0.0909 0.0202-0.13552 0.0338-0.0447 0.0135-0.0887 0.0294-0.13208 0.0474-0.0433 0.0181-0.0859 0.0384-0.12758 0.061-0.0967 0.06-0.21595 0.16341-0.35322 0.30374-4.083 3.8249-4.5376 8.9345-8.5943 11.692-0.1225 0.062-0.24859 0.11333-0.38453 0.15705-0.13594 0.0437-0.28172 0.0799-0.4436 0.11163-2.3544 0.3211-4.979 0.20941-7.0183-0.15174-0.37291-0.0835-0.70993-0.18286-1.0187-0.30659-0.30874-0.12372-0.58918-0.27185-0.84893-0.45295s-0.49879-0.39519-0.72473-0.65085c-0.22594-0.25565-0.43877-0.55288-0.64607-0.90026-0.20731-0.34739-0.4091-0.74493-0.61296-1.2012-2.6335-4.109-3.626-12.582-5.3312-12.803-1.677-0.42812-2.3203 13.477-2.6978 19.521-0.23862 3.1602-0.54006 6.2067-1.0085 9.2799-0.0889 0.53949-0.17608 0.99365-0.25935 1.3424-0.0833 0.3487-0.16263 0.59193-0.23588 0.70956-0.22 0.353-1.125 0.955-2.01 1.338-1.404 0.608-2.152 0.692-5.888 0.66-2.354-0.02-4.76-0.194-5.35-0.39-1.348-0.445-2.603-1.916-2.876-3.37-0.116-0.617 0.093-4.6 0.464-8.873 0.0464-0.53413 0.094-1.1166 0.14224-1.7363 0.66555-8.0301 0.85305-16.099 1.3484-24.084 0.0372-0.58395 0.0744-1.1434 0.11116-1.6688 0.83186-7.3426 0.98826-14.601 2.5175-21.839 0.0202-0.10306 0.0396-0.20627 0.0584-0.3096 0.43159-3.5409 1.4879-6.9206 3.167-10.044 0.21251-0.36703 0.42133-0.68518 0.62067-0.94017 2.237-1.9067 6.853-2.1223 9.3466-0.69943 0.22462 0.1571 0.44723 0.34222 0.67374 0.5595 0.22651 0.21727 0.45692 0.46672 0.69713 0.75246 1.1153 1.3685 2.0935 2.9022 3.0312 4.3151 0.46273 0.7019 0.9129 1.3944 1.3494 2.0758 1.9449 3.0199 3.7416 6.0495 5.3828 9.1491 2.4322 4.3637 3.3498 10.688 7.664 11.909 0.253 0 0.50373-0.0301 0.75381-0.0918 6.4123-3.6165 9.731-13.158 13.335-18.738 2.0699-3.2235 5.1726-7.3193 8.1334-7.5672 0.17498 2e-3 0.36812 0.0106 0.58487 0.0244 3.2132 0.0432 5.6906 0.70451 7.7936 3.164 0.95153 1.0918 1.094 2.3861 1.0442 3.7503-0.64191 8.4522-0.78967 17.019-1.3975 25.482-0.0232 0.3072-0.0464 0.59559-0.0692 0.85959-0.11525 1.3398-0.22809 2.6264-0.33792 3.8544s-0.21665 2.3971-0.31985 3.5018c-0.10319 1.1047-0.20277 2.1449-0.29811 3.115-1.3287 8.3322-1.6063 16.926-3.6732 25.505-0.152 0.247-0.954 3.745-1.512 6.595-0.68308 2.3217-2.1808 4.7746-4.108 4.321zm140.96-2.29c-1.677-1.32-2.57-4.438-3.057-10.674-0.165-2.113-0.803-8.667-1.417-14.564l-1.306-14.225c-0.104-1.926-0.24-3.586-0.304-3.69-0.24-0.39-0.646-9.98-0.63-14.894 0.023-6.948 0.8-10.905 2.29-11.525 1.095-0.458 8.46-1.64 9.38-1.506 0.51 0.075 1.438 0.588 2.066 1.142 1.122 0.99 1.163 1.114 2.393 7.248 1.373 6.846 1.93 11.133 1.94 14.95 0.01 3.03 0.687 4.735 2.412 6.052 1.12 0.856 1.45 0.93 4.5 1.032 5.02 0.166 9.854-1.014 10.78-2.63 0.404-0.704 0.41-16.3 0.01-21.848-0.194-2.68 0.25-6.088 1.048-8.05 0.295-0.727 0.802-1.207 1.64-1.553 0.666-0.275 2.234-0.99 3.485-1.59 2.918-1.397 3.817-1.39 5.48 0.033 2.493 2.135 3.23 4.68 4.22 14.563 0.797 7.972 0.914 9.668 1.31 19.046l0.648 12.964c0.316 5.26 0.075 16.624-0.52 24.51-0.182 2.403-0.27 2.657-1.29 3.653-1.036 1.013-1.217 1.07-3.407 1.072-3.243 3e-3 -8.255-0.56-9.112-1.02-1.37-0.738-1.674-1.677-1.998-6.157-0.778-10.763-1.445-14.128-3.14-15.828-0.837-0.84-0.94-0.86-3.423-0.658-3.93 0.32-7.558 1.056-8.462 1.716-0.45 0.328-1.105 1.164-1.457 1.856-0.577 1.138-0.645 1.967-0.7 8.548-0.084 10.327-0.604 11.775-4.45 12.405-1.04 0.17-3.275 0.3-4.967 0.31-2.666 0-3.194-0.1-3.952-0.687zm67.506-4.46c-3.49-0.47-4.286-0.825-4.864-2.165l-0.787-1.81c-0.183-0.415-0.056-1.865 0.36-4.12 0.353-1.913 0.58-3.58 0.504-3.703-0.26-0.423 0.814-3.062 1.476-3.622 0.495-0.42 1.238-0.56 2.947-0.56 6.058-4e-3 12.66-2.227 15.324-5.16 1.07-1.178 1.2-1.506 1.2-3.017 0-1.346-0.167-1.893-0.81-2.657-0.92-1.094-2.134-1.53-7.67-2.762-9.766-2.17-12.195-2.86-14.925-4.225-8.187-4.1-11.893-13.328-9.333-23.24 1.334-5.162 5.624-12.206 9.92-16.282 2.622-2.49 7.032-4.687 10.66-5.313 4.378-0.755 9.457-0.857 12.436-0.25 6.28 1.28 9.88 3.646 11.353 7.457 0.704 1.823 0.667 2.416-0.217 3.5-0.4 0.498-0.838 1.157-0.95 1.465-0.35 0.955-2.236 3.286-3.39 4.185-1.273 0.992-2.018 1.042-7.115 0.475-2.667-0.297-3.982-0.296-5.915 5e-3 -2.88 0.448-4.463 1.275-7.028 3.67-1.714 1.6-1.793 1.746-1.96 3.61-0.22 2.44 0.41 3.823 2.046 4.507 1.176 0.49 5.984 1.556 11.297 2.5 6.656 1.184 12.78 4.607 16.062 8.976 3.844 5.118 5.335 9.084 5.6 14.884 0.204 4.493-0.28 6.86-2.26 11.04-1.48 3.123-4.365 6.593-6.724 8.082-2.126 1.343-5.642 2.678-9.637 3.66-3.365 0.827-4.552 0.958-9.6 1.06-3.168 0.065-6.768-0.018-8-0.184zm-123.75-106.69c-2.044-0.564-4.347-2.547-5.454-4.695l-0.9-1.745 0.137-22.407c0.138-22.586 0.283-25.6 1.367-28.3 0.723-1.808 1.725-2.27 4.928-2.27 3.27 0 4.612 0.52 5.083 1.97 0.79 2.436 1.015 7.702 1 23.327-0.017 10.697 0.092 16.707 0.32 17.55 0.192 0.712 0.753 1.624 1.265 2.055 1.243 1.046 4.496 1.32 8.28 0.7 4.3-0.704 6.338-0.626 7.238 0.275 0.715 0.716 1.468 3.652 1.468 5.726 0 0.448 0.216 0.994 0.48 1.213 0.732 0.607 0.584 2.032-0.297 2.86-0.628 0.6-1.44 0.813-4.24 1.16-1.904 0.237-5.263 0.792-7.462 1.235s-5.368 0.954-7.04 1.136-3.4 0.398-3.84 0.48-1.486-0.04-2.325-0.272zm-21.882-2.582c-2.248-1.71-7.457-7.415-9.806-10.74-1.455-2.06-1.846-2.415-2.75-2.503-1.177-0.114-2.147 0.563-2.67 1.863-0.177 0.44-0.443 2.797-0.59 5.24-0.275 4.54-0.694 5.965-1.753 5.965-0.266 0-0.803 0.2-1.193 0.442-1.054 0.658-5.808 0.924-7.057 0.394-2.043-0.865-2.205-1.305-2.702-7.328-0.37-4.485-0.388-6.913-0.098-13.034 0.196-4.137 0.356-10.26 0.354-13.604-6e-3 -10.045 0.85-21.412 1.754-23.32 0.565-1.19 1.972-2.046 2.5-1.518 0.214 0.214 0.535 0.206 0.964-0.024 0.925-0.495 4.036-0.133 5.567 0.648 1.17 0.597 1.84 0.662 6.536 0.64 6.048-0.03 8.345 0.39 11.9 2.183 1.303 0.657 3.11 1.95 4.25 3.047 4.95 4.754 6.4 13.098 3.33 19.146-1.017 2.004-2.218 3.496-5.836 7.25-2.198 2.28-3.13 3.478-3.13 4.02 0 0.425 0.498 1.6 1.106 2.61 1.057 1.756 6.125 7.73 8.1 9.558 0.52 0.478 1.017 1.15 1.106 1.5 0.233 0.892-0.807 3.014-1.794 3.66-0.464 0.304-1.215 1.287-1.67 2.185-1.81 3.576-3.43 4.012-6.426 1.733zm-13.22-29.305c0.515 0 6.215-5.122 7.756-6.97 2.544-3.05 2.683-5.008 0.506-7.122-1.103-1.07-1.507-1.24-3.785-1.572-3.703-0.542-6.527 0.14-6.888 1.666-0.528 2.228-0.635 4.076-0.486 8.346 0.16 4.54 0.2 4.778 0.94 5.376 0.425 0.344 0.977 0.547 1.226 0.45s0.58-0.174 0.732-0.174zm80.305 29.986c-0.792-0.226-2.736-1.047-4.32-1.825-2.362-1.16-3.405-1.933-5.798-4.304-2.497-2.474-3.13-3.33-4.392-5.932-2.545-5.25-2.89-7.044-2.9-15.205-0.02-7.83 0.277-9.952 2.19-15.59 1.435-4.227 2.748-6.333 5.95-9.543 3.324-3.332 6.068-4.882 9.968-5.628 4.146-0.794 9.47-0.23 12.687 1.346 1.692 0.828 6.783 5.405 6.783 6.098 0 0.182 0.3 0.603 0.666 0.935s1.307 1.948 2.09 3.592c1.156 2.426 1.508 3.603 1.868 6.25 1.555 11.437 0.534 21.206-2.893 27.7-1.96 3.715-2.582 4.58-5.274 7.348-2.107 2.166-3.12 2.936-5.065 3.852-2.312 1.09-2.62 1.15-6.272 1.232-2.425 0.055-4.37-0.065-5.28-0.325zm7.26-12.72c2.085-0.785 4.625-4.263 5.508-7.54 0.193-0.716 0.553-3.142 0.8-5.393 0.464-4.212 0.313-6.34-0.797-11.215-0.447-1.965-2.5-6.188-3.816-7.85-1.702-2.15-4.83-2.503-7.353-0.832-1.74 1.15-4.006 4.642-5.014 7.72-0.715 2.184-0.86 3.292-0.99 7.527-0.173 5.735 0.358 9.223 1.852 12.16 2.128 4.182 6.576 6.64 9.81 5.423zm-119.42 11.374c-0.0564-0.0319-0.11259-0.0654-0.1678-0.0998-0.0552-0.0345-0.10942-0.0699-0.16176-0.10595-0.0524-0.036-0.10283-0.0726-0.1506-0.10918-0.0478-0.0366-0.0928-0.0733-0.13434-0.10954-0.15325-0.13375-0.29125-0.27105-0.41542-0.41925-3.0472-4.8427 2.0513-13.615-5.1165-13.501-5.48 0.09-9.804 1.262-11.028 3-0.039 0.055-0.0829 0.13794-0.13086 0.24543-0.0479 0.10748-0.0998 0.23952-0.15478 0.39273-0.85999 2.5108-1.3147 5.4804-1.8345 7.7957-0.10423 0.41407-0.20833 0.75393-0.32436 1.0332-1.3876 2.09-4.9823 1.492-7.2901 1.3189-0.13203-0.0213-0.24082-0.0488-0.3334-0.0837-0.0926-0.0349-0.16898-0.0773-0.2362-0.12821-0.0672-0.0509-0.1253-0.11036-0.18124-0.17949-0.0559-0.0691-0.10978-0.14794-0.16853-0.23757-0.11062-0.16875-0.2084-0.39541-0.29336-0.68207-0.86386-5.11-0.29092-10.511 0.0903-15.558 0.65-8.587 1.916-17.96 2.597-19.234 0.168-0.314 0.305-1.07 0.305-1.678 0-1.62 1.156-5.13 2.654-8.057 1.85-3.617 5.62-7.397 8.96-8.983 4.47-2.124 12.066-2.258 16.117-0.284 2.337 1.14 5.102 4.22 6.75 7.518 2.007 4.02 2.475 8.196 2.186 19.515-0.307 12.055-0.472 15.542-0.986 20.844-0.474 4.883-1.095 7.116-2.135 7.673-2.8308 0.51458-5.8386 0.92722-8.4165 0.11349zm-1.7705-25.72c1.234-0.907 1.64-2.076 1.825-5.27 0.222-3.826-0.36-8.603-1.276-10.463-1.203-2.445-3.873-3.42-6.99-2.555-1.475 0.4-3.717 2.78-4.843 5.116-1.052 2.184-2.63 10.122-2.33 11.72 0.272 1.452 0.797 1.65 5.294 2.013 4.687 0.378 7.282 0.203 8.32-0.56zm149.59 25.856c-0.977-0.163-1.805-0.52-2.126-0.916-1.006-1.242-1.724-7.47-2.197-19.068-0.158-3.873-0.5-8.915-0.763-11.203-0.562-4.914-0.74-11.45-0.503-18.636 0.19-5.823 0.45-6.56 2.567-7.325 1.508-0.545 4.89-0.544 6.198 3e-3 0.888 0.37 1.19 0.774 1.745 2.32 0.368 1.03 0.872 2.23 1.12 2.672 1.233 2.198 4.737 8.03 5.674 9.443 0.584 0.88 1.84 2.897 2.793 4.48s2.027 3.205 2.388 3.6c0.785 0.86 1.67 0.933 1.98 0.16 0.123-0.308 0.352-4.737 0.51-9.843 0.446-14.53 0.234-14.05 6.12-13.876 4.854 0.144 5.054 0.305 5.39 4.332 0.13 1.552 0.162 7.72 0.07 13.705-0.102 6.704 0 14.816 0.264 21.126 0.574 13.71 0.56 15.44-0.127 16.72-0.676 1.26-1.27 1.427-5.284 1.482-3.884 0.054-4.343-0.207-6.273-3.562-0.784-1.362-2.673-4.422-4.198-6.798s-3.37-5.4-4.1-6.697c-2.273-4.068-3.144-3.886-2.926 0.61 0.73 15.112 0.658 16.2-1.15 17.144-0.988 0.51-4.485 0.57-7.17 0.123zm47.357-3.366c-4.544-0.82-4.993-1.674-3.8-7.21 0.428-1.984 0.933-3.794 1.123-4.022 0.217-0.26 1.13-0.42 2.465-0.425 5.205-0.024 9.703-1.347 11.66-3.43 0.773-0.823 0.885-1.175 0.8-2.51-0.128-2.006-0.91-2.554-5.4-3.79-9.06-2.49-11.345-3.39-13.545-5.32-3.917-3.44-5.484-9.887-3.772-15.52 1.644-5.4 6.927-12.037 11.104-13.926 8.484-3.84 20.62-1.185 22.248 4.868 0.208 0.77 0.25 1.53 0.097 1.73s-0.648 0.92-1.107 1.61c-1.077 1.613-3.33 3.646-4.046 3.652-0.307 3e-3 -1.975-0.24-3.706-0.54-4.32-0.75-6.572-0.376-9.06 1.503-3.36 2.538-3.578 5.598-0.492 6.902 0.648 0.274 2.906 0.913 5.018 1.42 4.908 1.18 6.078 1.603 8.72 3.148 2.87 1.68 4.755 3.61 6.384 6.535 1.73 3.1 2.337 5.5 2.333 9.24-4e-3 3.296-0.397 4.946-1.88 7.886-0.99 1.96-3.945 5.19-5.49 5.995-4.607 2.406-13.192 3.367-19.655 2.2zm-265.1-1.2758c-0.0478-0.0621-0.0891-0.12945-0.12461-0.20524-0.0356-0.0758-0.0654-0.16004-0.0904-0.25598 0.88001-12.152 0.96436-25.366 2.0615-35.516 0.356-3.081 0.73-7.583 0.83-10.005 0.187-4.53 0.858-8.673 1.652-10.21 0.568-1.1 2.313-1.416 5.21-0.946 1.808 0.293 2.228 0.512 3.74 1.943 0.937 0.887 1.75 1.622 1.803 1.633s1.827 0.09 3.94 0.172c9.912 0.39 15.15 3.967 17.99 12.29 0.706 2.067 0.818 2.94 0.8 6.277-0.01 4.43-0.47 6.447-2.234 9.816-1.418 2.71-3.696 4.834-7.016 6.543-4.567 3.4726-10.643 1.769-15.049 4.2672-0.0913 0.0726-0.17762 0.15173-0.26449 0.23885-0.13325 0.13338-0.25847 0.28377-0.37646 0.4543-0.11799 0.17054-0.22874 0.36122-0.33307 0.57517-1.8902 4.0256-0.83285 8.4007-2.234 12.182-0.0805 0.16019-0.16887 0.29502-0.26715 0.4112-0.0983 0.11618-0.20648 0.21371-0.32668 0.29928-3.9005 0.0705-7.4881 1.6826-9.7111 0.0358zm21.672-28.041c1.864-1.052 3.353-2.467 4.13-3.924 0.838-1.573 0.65-4.857-0.416-7.23-0.783-1.745-1.078-2.077-2.35-2.646-1.775-0.793-6.272-1.127-7.356-0.547s-1.846 2.687-2.28 6.292c-0.444 3.696-0.074 7.454 0.832 8.456 1.08 1.193 4.99 0.983 7.44-0.4z" fill="#ae3402"/>
<path d="m415.2 723.69c-77.09-1.117-146.6-16.08-168.99-36.372-6.102-5.53-8.596-10.057-8.596-15.604 0-5.105 2.288-9.537 7.467-14.467 2.652-2.525 7.658-6.34 8.32-6.34 15.753 19.071 35.353 29.042 53.804 34.672 23.373 6.93 50.746 10.962 88.796 13.084 11.082 0.618 45.46 0.517 57.597-0.17 50.404-2.85 86.32-9.742 112.31-21.558 15.371-6.6248 22.616-16.005 32.428-26.023 0.785-8e-3 5.604 3.62 8.488 6.39 5.9 5.668 8.25 11.054 7.302 16.732-2.612 15.626-30.01 29.928-75.3 39.306-35.207 7.3-79.408 11-123.63 10.35zm-92.155-394.38c-17.753-0.94-36.624-2.384-36.725-2.81-0.04-0.17 0.722-0.55 1.692-0.844 4.233-1.29 13.865-2.5 28.284-3.526l9.89-0.71 0.572 0.707c0.715 0.883 1.902 3.98 2.12 5.53 0.133 0.95 0.052 1.198-0.434 1.333-1.03 0.287-3.4 0.43-5.397 0.324zm225.75-1.845c0-0.254 0.136-0.545 0.302-0.648s0.906-1.282 1.645-2.62l1.343-2.434 3.715 0.217c9.274 0.54 24.623 2.186 25.624 2.746 0.38 0.213 0.316 0.306-0.314 0.447-2.075 0.463-27.683 2.752-30.793 2.753-1.1 0-1.52-0.124-1.52-0.46z" fill="#28152c"/>
<path d="m285.81 325.65c28.983 4.3786 136.42 4.9563 211.06 4.3532 24.296-0.1963 51.67-2.2896 57.62-2.7734 14.367-1.1677 29.245-1.7538 24.915-2.524-15.23-2.7086-41.192-3.7401-73.765-4.8498l6.2491-18.1c27.817 4.0883 118.08 0.86572 114.87 27.106-2.6787 7.3718-4.6217 10.885-20.149 15.495-54.576 9.1261-113.46 8.4864-170.38 10.359-63.015-0.3324-147.03-1.3997-191.89-10.611-6.429-1.5579-10.836-3.3404-13.528-5.724-6.8131-6.0314-4.8447-11.98-4.2947-13.569 0.85052-2.4568 3.0426-6.4129 8.6817-9.1655 7.9608-3.886 20.67-6.2848 27.757-6.592 11.131-0.93829 16.625-1.7173 27.093-2.2781 18.642-0.9987 41.948-1.5102 61.815-2.4563l2.2566 16.193c-27.154 0.78345-43.225 2.1439-68.303 5.1367z" fill="#ae3402" stroke-opacity="0"/>
</svg>