PARAMS G=0.01 dt=0.025 fa=1 rayon=500
Soleil: Fixe masse=30 posx=0 posy=0
Planete1: Simule masse=1 posx=-100 posy=0 vitx=0 vity=0.06
Planete2: Simule masse=3 posx=0 posy=350 vitx=0.030 vity=0
X: Vaisseau masse=0.001 posx=75 posy=333 vitx=0 vity=0.017 pprincipal=0.0001 pretro=0.0000001
