<?xml version="1.0" encoding="UTF-8" standalone="no"?>
<!-- Created with Inkscape (http://www.inkscape.org/) -->

<svg
   width="84.58696mm"
   height="86.928894mm"
   viewBox="0 0 84.58696 86.928894"
   version="1.1"
   id="svg1"
   inkscape:version="1.3 (0e150ed6c4, 2023-07-21)"
   sodipodi:docname="pqGeometryFilter.svg"
   xmlns:inkscape="http://www.inkscape.org/namespaces/inkscape"
   xmlns:sodipodi="http://sodipodi.sourceforge.net/DTD/sodipodi-0.dtd"
   xmlns="http://www.w3.org/2000/svg"
   xmlns:svg="http://www.w3.org/2000/svg">
  <sodipodi:namedview
     id="namedview1"
     pagecolor="#ffffff"
     bordercolor="#000000"
     borderopacity="0.25"
     inkscape:showpageshadow="2"
     inkscape:pageopacity="0.0"
     inkscape:pagecheckerboard="0"
     inkscape:deskcolor="#d1d1d1"
     inkscape:document-units="mm"
     inkscape:zoom="1.4677327"
     inkscape:cx="235.39709"
     inkscape:cy="343.04612"
     inkscape:window-width="2560"
     inkscape:window-height="1395"
     inkscape:window-x="0"
     inkscape:window-y="45"
     inkscape:window-maximized="1"
     inkscape:current-layer="layer1" />
  <defs
     id="defs1" />
  <g
     inkscape:label="Layer 1"
     inkscape:groupmode="layer"
     id="layer1"
     transform="translate(-0.22566775,-0.10197067)">
    <circle
       style="fill:#ffffff;fill-opacity:1;stroke:#000000;stroke-width:8;stroke-dasharray:none;stroke-dashoffset:8.52598;stroke-opacity:1"
       id="path1"
       cx="22.404152"
       cy="21.667158"
       r="16.507919" />
    <rect
       style="fill:#ffffff;fill-opacity:1;stroke:#000000;stroke-width:7.25793;stroke-dasharray:none;stroke-dashoffset:8.52598;stroke-opacity:1"
       id="rect1"
       width="29.455709"
       height="30.779686"
       x="49.801437"
       y="29.002811"
       rx="0"
       ry="0" />
    <path
       style="fill:#ffffff;fill-opacity:1;stroke:#000000;stroke-width:7.99999;stroke-dasharray:none;stroke-dashoffset:8.52598;stroke-opacity:1"
       d="M 29.208487,50.58655 11.959071,81.14916 h 33.148678 z"
       id="path2"
       sodipodi:nodetypes="cccc" />
  </g>
</svg>
