<?xml version="1.0" encoding="UTF-8" standalone="no"?>
<svg
   id="Layer_1"
   data-name="Layer 1"
   viewBox="0 0 64 64"
   version="1.1"
   sodipodi:docname="pqXRotate.svg"
   inkscape:version="1.1.2 (0a00cf5339, 2022-02-04)"
   xmlns:inkscape="http://www.inkscape.org/namespaces/inkscape"
   xmlns:sodipodi="http://sodipodi.sourceforge.net/DTD/sodipodi-0.dtd"
   xmlns="http://www.w3.org/2000/svg"
   xmlns:svg="http://www.w3.org/2000/svg">
  <defs
     id="defs927" />
  <sodipodi:namedview
     id="namedview925"
     pagecolor="#ffffff"
     bordercolor="#999999"
     borderopacity="1"
     inkscape:pageshadow="0"
     inkscape:pageopacity="0"
     inkscape:pagecheckerboard="0"
     showgrid="true"
     inkscape:zoom="9.3139221"
     inkscape:cx="31.297234"
     inkscape:cy="30.223573"
     inkscape:window-width="1916"
     inkscape:window-height="1050"
     inkscape:window-x="1920"
     inkscape:window-y="26"
     inkscape:window-maximized="1"
     inkscape:current-layer="Layer_1">
    <inkscape:grid
       type="xygrid"
       id="grid2271" />
  </sodipodi:namedview>
  <text
     xml:space="preserve"
     style="font-style:normal;font-weight:normal;font-size:43.2016px;line-height:1.25;font-family:sans-serif;letter-spacing:0px;word-spacing:0px;fill:#787878;fill-opacity:1;stroke:#6f6f59;stroke-width:1;stroke-miterlimit:4;stroke-dasharray:none;stroke-opacity:1"
     x="4.5429206"
     y="63.052792"
     id="text5739"
     transform="scale(1.0572314,0.94586673)"><tspan
       sodipodi:role="line"
       id="tspan5737"
       x="4.5429206"
       y="63.052792"
       style="fill:#787878;fill-opacity:1;stroke:#6f6f59;stroke-width:1;stroke-miterlimit:4;stroke-dasharray:none;stroke-opacity:1">X</tspan></text>
  <path
     d="M 59,58.49 V 32 L 39,45.24 Z"
     style="fill:#de4130;stroke:#6f6f59;stroke-width:2.2536px;stroke-linecap:round;stroke-linejoin:round;fill-opacity:1"
     id="path908" />
  <path
     d="m 33.142369,13.856629 0.112103,0.0916 5.404146,2.627756 a 0.70081762,0.83873442 50.63114 0 0 0.798179,-0.07844 0.70707493,0.84622315 50.631139 0 0 0.438821,-0.70857 l 0.03435,-1.837039 a 16.037461,19.193539 50.631141 0 1 14.012641,14.642149 1.3515768,1.6175592 50.631139 0 0 0.422638,0.951033 1.3515768,1.6175592 50.631139 0 0 2.604538,-1.409661 A 18.771902,22.4661 50.631144 0 0 40,11 L 40.03567,8.8275487 A 0.68204576,0.81626829 50.631145 0 0 39.817304,8.3318534 0.77590528,0.92859881 50.631145 0 0 39.656459,8.200421 0.70081762,0.83873442 50.63114 0 0 38.841888,8.3616011 l -5.533564,4.2942969 a 0.69456031,0.83124575 50.631137 0 0 -0.354014,0.672117 0.70707493,0.84622315 50.631139 0 0 0.188059,0.528614 z"
     style="fill:#47b1d8;stroke:#6f6f59;stroke-width:1.54198;stroke-miterlimit:4;stroke-dasharray:none;stroke-opacity:1"
     id="path920" />
  <path
     d="M 33.25,6 H 6.76 L 20,26 Z"
     style="fill:#de4130;stroke:#6f6f59;stroke-width:2.2536px;stroke-linecap:round;stroke-linejoin:round;fill-opacity:1"
     id="path908-3" />
  <circle
     cx="19.889297"
     cy="45.069828"
     style="fill:#de4130;stroke:#6f6f59;stroke-width:0.944882;stroke-miterlimit:4;stroke-dasharray:none;stroke-opacity:1;fill-opacity:1"
     id="circle2535"
     r="3.895" />
  <g
     id="g3267"
     transform="translate(0,-3.7212296)">
    <line
       x1="20.003811"
       y1="21.310543"
       x2="20.003811"
       y2="16.83474"
       style="fill:none;stroke:#6f6f59;stroke-width:1.44453px;stroke-linecap:round;stroke-linejoin:round"
       id="line158" />
    <line
       x1="20.003811"
       y1="10.50758"
       x2="20.003811"
       y2="6.0317779"
       style="fill:none;stroke:#6f6f59;stroke-width:1.44453px;stroke-linecap:round;stroke-linejoin:round"
       id="line160" />
    <line
       x1="20"
       y1="43"
       x2="20"
       y2="38.524193"
       style="fill:none;stroke:#6f6f59;stroke-width:1.44453px;stroke-linecap:round;stroke-linejoin:round"
       id="line158-1" />
    <line
       x1="20"
       y1="32.197033"
       x2="20"
       y2="27.72123"
       style="fill:none;stroke:#6f6f59;stroke-width:1.44453px;stroke-linecap:round;stroke-linejoin:round"
       id="line160-1" />
  </g>
  <g
     id="g3261"
     transform="rotate(-90,34.346634,45.657177)">
    <line
       x1="35.003811"
       y1="52.310543"
       x2="35.003811"
       y2="47.834736"
       style="fill:none;stroke:#6f6f59;stroke-width:1.44453px;stroke-linecap:round;stroke-linejoin:round"
       id="line158-6" />
    <line
       x1="35.003811"
       y1="41.50758"
       x2="35.003811"
       y2="37.031773"
       style="fill:none;stroke:#6f6f59;stroke-width:1.44453px;stroke-linecap:round;stroke-linejoin:round"
       id="line160-7" />
    <line
       x1="35"
       y1="74"
       x2="35"
       y2="69.5242"
       style="fill:none;stroke:#6f6f59;stroke-width:1.44453px;stroke-linecap:round;stroke-linejoin:round"
       id="line158-1-5" />
    <line
       x1="35"
       y1="63.197029"
       x2="35"
       y2="58.72123"
       style="fill:none;stroke:#6f6f59;stroke-width:1.44453px;stroke-linecap:round;stroke-linejoin:round"
       id="line160-1-3" />
  </g>
</svg>
