{
  "name": "ANGULAR IONIC Dev Container",
  "dockerComposeFile": "../docker-compose.yml",
  "service": "angular",
  "customizations": {
      "vscode": {
          "extensions": [
            "johnpapa.Angular2",
            "sidthesloth.html5-boilerplate",
            "Angular.ng-template",
            "alexiv.vscode-angular2-files",
            "cyrilletuzi.angular-schematics",
            "AnbuselvanRocky.bootstrap5-vscode",
            "ecmel.vscode-html-css"
          ]
      }
  },
  "mounts": [
    "source=${localWorkspaceFolder},target=/project,type=bind,consistency=cached"
  ],
  "workspaceFolder": "/project"
}
