{
	"info": {
		"_postman_id": "e8d24442-3c9d-429e-a194-21813c18e76b",
		"name": "TP Devops",
		"schema": "https://schema.getpostman.com/json/collection/v2.1.0/collection.json",
		"_exporter_id": "33450279"
	},
	"item": [
		{
			"name": "STATUS",
			"event": [
				{
					"listen": "test",
					"script": {
						"exec": [
							"pm.test(\"Status code is 200\", function () {",
							"    pm.response.to.have.status(200);",
							"})"
						],
						"type": "text/javascript"
					}
				}
			],
			"request": {
				"method": "GET",
				"header": [],
				"url": {
					"raw": "{{URL_APP}}/status",
					"host": [
						"{{URL_APP}}"
					],
					"path": [
						"status"
					]
				}
			},
			"response": []
		},
		{
			"name": "CITY",
			"event": [
				{
					"listen": "test",
					"script": {
						"exec": [
							"pm.test(\"Status code is 200\", function () {",
							"    pm.response.to.have.status(200);",
							"})"
						],
						"type": "text/javascript"
					}
				}
			],
			"request": {
				"method": "GET",
				"header": [],
				"url": {
					"raw": "{{URL_APP}}/city",
					"host": [
						"{{URL_APP}}"
					],
					"path": [
						"city"
					]
				}
			},
			"response": []
		},
		{
			"name": "404",
			"event": [
				{
					"listen": "test",
					"script": {
						"exec": [
							"pm.test(\"Status code is 200\", function () {",
							"    pm.response.to.have.status(404);",
							"})"
						],
						"type": "text/javascript"
					}
				}
			],
			"request": {
				"method": "GET",
				"header": [],
				"url": {
					"raw": "{{URL_APP}}/404",
					"host": [
						"{{URL_APP}}"
					],
					"path": [
						"404"
					]
				}
			},
			"response": []
		}
	]
}