{
  "method": "CREATE",
  "pdb_name": "pdbtest",
  "adminName": "pdbadmin",
  "adminPwd": "W3lc0m31",
  "fileNameConversions": "NONE",
  "reuseTempFile": true,
  "totalSize": "2G",
  "tempSize": "800M"
}

