module gitlab.com/guillaume.fenollar/kubectl-health

go 1.13

require (
	github.com/sirupsen/logrus v1.4.2
	k8s.io/api v0.0.0-20190620084959-7cf5895f2711
	k8s.io/apimachinery v0.0.0-20190612205821-1799e75a0719
	k8s.io/client-go v0.0.0-20190620085101-78d2af792bab
)
