<svg
   xmlns:dc="http://purl.org/dc/elements/1.1/"
   xmlns:cc="http://creativecommons.org/ns#"
   xmlns:rdf="http://www.w3.org/1999/02/22-rdf-syntax-ns#"
   xmlns:svg="http://www.w3.org/2000/svg"
   xmlns="http://www.w3.org/2000/svg"
   xmlns:xlink="http://www.w3.org/1999/xlink"
   xmlns:sodipodi="http://sodipodi.sourceforge.net/DTD/sodipodi-0.dtd"
   xmlns:inkscape="http://www.inkscape.org/namespaces/inkscape"
   viewBox="0 0 984 718"
   version="1.1"
   id="svg8"
   inkscape:version="0.92.4 5da689c313, 2019-01-14"
   sodipodi:docname="chateau.svg">
  <defs
     id="defs2" />
  <sodipodi:namedview
     id="base"
     pagecolor="#ffffff"
     bordercolor="#666666"
     borderopacity="1.0"
     inkscape:pageopacity="0.0"
     inkscape:pageshadow="2"
     inkscape:zoom="1.979899"
     inkscape:cx="615.94784"
     inkscape:cy="285.455"
     inkscape:document-units="px"
     inkscape:current-layer="layer1"
     showgrid="false"
     inkscape:window-width="1920"
     inkscape:window-height="1136"
     inkscape:window-x="0"
     inkscape:window-y="27"
     inkscape:window-maximized="1"
     units="px" />
  <metadata
     id="metadata5">
    <rdf:RDF>
      <cc:Work
         rdf:about="">
        <dc:format>image/svg+xml</dc:format>
        <dc:type
           rdf:resource="http://purl.org/dc/dcmitype/StillImage" />
        <dc:title />
      </cc:Work>
    </rdf:RDF>
  </metadata>
  <style
     id="style5">
        path {
            fill: #a9a9a9;
            opacity: 0.6;
            transition: 0.15s;
            transform-origin: 50% 50%;
        }

        path:hover {

            fill: #ec008c;
            opacity: 1;
            /*transform: translateY(-50%) translateX(-50%) scale(0.25);*/

            transform: scale(1.08);
        }
    </style>
  <g
     inkscape:label="Calque 1"
     inkscape:groupmode="layer"
     id="layer1">
    <image
       xlink:href="https://cloud.magnyethique.org/apps/files_sharing/publicpreview/AsK6Ab6n7GixAiL?file=/&fileId=47206&x=960&y=540&a=true&etag=a36ca15f4ecf72a722f59e053f90ac27"
       width="984"
       height="718"
       preserveAspectRatio="none"
       style="image-rendering:optimizeSpeed"
       id="image823"
       x="0"
       y="0" />
  </g>
</svg>
