<svg width="28" height="28" viewBox="0 0 28 28" fill="none" xmlns="http://www.w3.org/2000/svg">
<path d="M15.375 24.9147C18.1488 24.5618 20.6841 23.1659 22.4656 21.0108C24.2472 18.8557 25.1412 16.1031 24.9661 13.3125C24.7911 10.5218 23.5599 7.90255 21.523 5.98702C19.486 4.0715 16.7961 3.00347 14 3C11.2004 2.99792 8.50543 4.06334 6.46409 5.97918C4.42275 7.89502 3.18871 10.5171 3.0134 13.3112C2.83809 16.1052 3.73471 18.861 5.52057 21.017C7.30643 23.173 9.84714 24.5669 12.625 24.9147V16.75H9.875V14H12.625V11.7257C12.625 9.88737 12.8175 9.2205 13.175 8.54812C13.5272 7.88288 14.0714 7.33907 14.737 6.9875C15.2622 6.70563 15.9154 6.5365 17.0566 6.46362C17.509 6.43475 18.0948 6.4705 18.8139 6.57363V9.18612H18.125C16.8641 9.18612 16.343 9.24525 16.0322 9.41162C15.8468 9.50699 15.6959 9.65795 15.6005 9.84338C15.4355 10.1541 15.375 10.4621 15.375 11.7244V14H18.8125L18.125 16.75H15.375V24.9147ZM14 27.75C6.40588 27.75 0.25 21.5941 0.25 14C0.25 6.40588 6.40588 0.25 14 0.25C21.5941 0.25 27.75 6.40588 27.75 14C27.75 21.5941 21.5941 27.75 14 27.75Z" fill="#004B6F"/>
</svg>
