<svg width="28" height="22" viewBox="0 0 28 22" fill="none" xmlns="http://www.w3.org/2000/svg">
<path d="M24.4583 4.11812C24.3538 3.70837 24.0567 3.399 23.7171 3.30412C23.1162 3.135 20.1875 2.75 14 2.75C7.8125 2.75 4.8865 3.135 4.28013 3.30412C3.94463 3.39762 3.64762 3.707 3.54175 4.11812C3.39188 4.70112 3 7.1445 3 11C3 14.8555 3.39188 17.2975 3.54175 17.8833C3.64625 18.2916 3.94325 18.601 4.2815 18.6945C4.8865 18.865 7.8125 19.25 14 19.25C20.1875 19.25 23.1149 18.865 23.7199 18.6959C24.0554 18.6024 24.3524 18.293 24.4583 17.8819C24.6081 17.2989 25 14.85 25 11C25 7.15 24.6081 4.7025 24.4583 4.11812ZM27.1216 3.43475C27.75 5.885 27.75 11 27.75 11C27.75 11 27.75 16.115 27.1216 18.5653C26.7724 19.9196 25.7507 20.9853 24.4569 21.3455C22.107 22 14 22 14 22C14 22 5.89712 22 3.54312 21.3455C2.24375 20.9797 1.2235 19.9155 0.878375 18.5653C0.25 16.115 0.25 11 0.25 11C0.25 11 0.25 5.885 0.878375 3.43475C1.22763 2.08038 2.24925 1.01475 3.54312 0.6545C5.89712 -2.45869e-07 14 0 14 0C14 0 22.107 -2.45869e-07 24.4569 0.6545C25.7562 1.02025 26.7765 2.0845 27.1216 3.43475ZM11.25 15.8125V6.1875L19.5 11L11.25 15.8125Z" fill="#004B6F"/>
</svg>
