<svg width="25" height="26" viewBox="0 0 25 26" fill="none" xmlns="http://www.w3.org/2000/svg">
<path d="M12.5 9.12516C11.5054 9.12516 10.5516 9.53342 9.84835 10.2601C9.14509 10.9868 8.75 11.9724 8.75 13.0002C8.75 14.0279 9.14509 15.0135 9.84835 15.7402C10.5516 16.4669 11.5054 16.8752 12.5 16.8752C13.4946 16.8752 14.4484 16.4669 15.1517 15.7402C15.8549 15.0135 16.25 14.0279 16.25 13.0002C16.25 11.9724 15.8549 10.9868 15.1517 10.2601C14.4484 9.53342 13.4946 9.12516 12.5 9.12516ZM12.5 6.54183C14.1576 6.54183 15.7473 7.22226 16.9194 8.43343C18.0915 9.6446 18.75 11.2873 18.75 13.0002C18.75 14.713 18.0915 16.3557 16.9194 17.5669C15.7473 18.7781 14.1576 19.4585 12.5 19.4585C10.8424 19.4585 9.25268 18.7781 8.08058 17.5669C6.90848 16.3557 6.25 14.713 6.25 13.0002C6.25 11.2873 6.90848 9.6446 8.08058 8.43343C9.25268 7.22226 10.8424 6.54183 12.5 6.54183ZM20.625 6.21891C20.625 6.64713 20.4604 7.0578 20.1674 7.3606C19.8743 7.66339 19.4769 7.8335 19.0625 7.8335C18.6481 7.8335 18.2507 7.66339 17.9576 7.3606C17.6646 7.0578 17.5 6.64713 17.5 6.21891C17.5 5.7907 17.6646 5.38002 17.9576 5.07723C18.2507 4.77444 18.6481 4.60433 19.0625 4.60433C19.4769 4.60433 19.8743 4.77444 20.1674 5.07723C20.4604 5.38002 20.625 5.7907 20.625 6.21891ZM12.5 2.66683C9.4075 2.66683 8.9025 2.67587 7.46375 2.74175C6.48375 2.78954 5.82625 2.92516 5.21625 3.17058C4.67375 3.38758 4.2825 3.6472 3.86625 4.07862C3.47501 4.46922 3.17419 4.94608 2.98625 5.47362C2.74875 6.10654 2.6175 6.78466 2.5725 7.79604C2.5075 9.22204 2.5 9.72062 2.5 13.0002C2.5 16.1957 2.50875 16.7176 2.5725 18.2043C2.61875 19.2157 2.75 19.8964 2.98625 20.5254C3.19875 21.0873 3.44875 21.4916 3.86375 21.9204C4.285 22.3544 4.67625 22.614 5.21375 22.8285C5.83125 23.0752 6.48875 23.2121 7.46375 23.2586C8.84375 23.3257 9.32625 23.3335 12.5 23.3335C15.5925 23.3335 16.0975 23.3245 17.5362 23.2586C18.5138 23.2108 19.1725 23.0752 19.7825 22.831C20.3237 22.6127 20.7175 22.3531 21.1325 21.9243C21.5538 21.489 21.805 21.0847 22.0125 20.5293C22.25 19.8925 22.3825 19.2118 22.4275 18.2043C22.4925 16.7783 22.5 16.2797 22.5 13.0002C22.5 9.80458 22.4912 9.28275 22.4275 7.79604C22.3812 6.78595 22.25 6.10395 22.0125 5.47362C21.8241 4.94662 21.5238 4.46995 21.1337 4.07862C20.7559 3.67413 20.2944 3.36325 19.7837 3.16929C19.1712 2.92387 18.5138 2.78825 17.5362 2.74175C16.1562 2.67458 15.6737 2.66683 12.5 2.66683ZM12.5 0.0834961C15.8962 0.0834961 16.32 0.0964127 17.6525 0.160996C18.9837 0.225579 19.89 0.441288 20.6875 0.761621C21.5125 1.0897 22.2075 1.53404 22.9025 2.25091C23.5381 2.89661 24.0299 3.67767 24.3438 4.53975C24.6525 5.36254 24.8625 6.30029 24.925 7.67591C24.9838 9.05283 25 9.4907 25 13.0002C25 16.5096 24.9875 16.9475 24.925 18.3244C24.8625 19.7 24.6525 20.6365 24.3438 21.4606C24.0308 22.3231 23.5389 23.1044 22.9025 23.7494C22.2775 24.406 21.5216 24.9142 20.6875 25.2387C19.8912 25.5577 18.9837 25.7747 17.6525 25.8393C16.32 25.9 15.8962 25.9168 12.5 25.9168C9.10375 25.9168 8.68 25.9039 7.3475 25.8393C6.01625 25.7747 5.11 25.5577 4.3125 25.2387C3.47791 24.9151 2.72191 24.4068 2.0975 23.7494C1.46176 23.1038 0.969914 22.3227 0.65625 21.4606C0.34625 20.6378 0.1375 19.7 0.0749999 18.3244C0.0162499 16.9475 0 16.5096 0 13.0002C0 9.4907 0.0124999 9.05283 0.0749999 7.67591C0.1375 6.299 0.34625 5.36383 0.65625 4.53975C0.969045 3.67714 1.461 2.89587 2.0975 2.25091C2.72209 1.59375 3.47804 1.08548 4.3125 0.761621C5.11 0.441288 6.015 0.225579 7.3475 0.160996C8.68 0.100288 9.10375 0.0834961 12.5 0.0834961Z" fill="#004B6F"/>
</svg>
