







############################
last record =  5188
1384476420.0,"15/11 01-47",19.4,66
1384476540.0,"15/11 01-49",19.3,66
1384476660.0,"15/11 01-51",19.3,66
1384476780.0,"15/11 01-53",19.3,66
1384476900.0,"15/11 01-55",19.3,66
1384477020.0,"15/11 01-57",19.3,66
1384477140.0,"15/11 01-59",19.3,66
1384477260.0,"15/11 02-01",19.3,66
1384477380.0,"15/11 02-03",19.3,66
1384477500.0,"15/11 02-05",19.3,66
1384477620.0,"15/11 02-07",19.3,66
1384477740.0,"15/11 02-09",19.3,66
1384477860.0,"15/11 02-11",19.3,66
1384477980.0,"15/11 02-13",19.3,66
1384478100.0,"15/11 02-15",19.3,66
1384478220.0,"15/11 02-17",19.3,66
1384478340.0,"15/11 02-19",19.3,66
1384478460.0,"15/11 02-21",19.3,66
1384478580.0,"15/11 02-23",19.3,66
1384478700.0,"15/11 02-25",19.3,66
1384478820.0,"15/11 02-27",19.3,66
1384478940.0,"15/11 02-29",19.3,66
1384479060.0,"15/11 02-31",19.3,66
1384479180.0,"15/11 02-33",19.3,66
1384479300.0,"15/11 02-35",19.3,66
1384479420.0,"15/11 02-37",19.2,66
1384479540.0,"15/11 02-39",19.2,66
1384479660.0,"15/11 02-41",19.2,66
1384479780.0,"15/11 02-43",19.2,65
1384479900.0,"15/11 02-45",19.2,65
1384480020.0,"15/11 02-47",19.2,65
1384480140.0,"15/11 02-49",19.2,65
1384480260.0,"15/11 02-51",19.2,65
1384480380.0,"15/11 02-53",19.2,65
1384480500.0,"15/11 02-55",19.2,65
1384480620.0,"15/11 02-57",19.2,65
1384480740.0,"15/11 02-59",19.2,65
1384480860.0,"15/11 03-01",19.2,65
1384480980.0,"15/11 03-03",19.2,65
1384481100.0,"15/11 03-05",19.2,65
1384481220.0,"15/11 03-07",19.2,65
1384481340.0,"15/11 03-09",19.2,65
1384481460.0,"15/11 03-11",19.1,65
1384481580.0,"15/11 03-13",19.1,65
1384481700.0,"15/11 03-15",19.1,65
1384481820.0,"15/11 03-17",19.1,65
1384481940.0,"15/11 03-19",19.1,65
1384482060.0,"15/11 03-21",19.1,65
1384482180.0,"15/11 03-23",19.1,65
1384482300.0,"15/11 03-25",19.1,65
1384482420.0,"15/11 03-27",19.1,65
1384482540.0,"15/11 03-29",19.1,65
1384482660.0,"15/11 03-31",19.1,65
1384482780.0,"15/11 03-33",19.1,65
1384482900.0,"15/11 03-35",19.1,65
1384483020.0,"15/11 03-37",19.1,65
1384483140.0,"15/11 03-39",19.1,65
1384483260.0,"15/11 03-41",19.1,65
1384483380.0,"15/11 03-43",19.1,65
1384483500.0,"15/11 03-45",19.1,65
1384483620.0,"15/11 03-47",19.1,65
1384483740.0,"15/11 03-49",19.1,65
1384483860.0,"15/11 03-51",19.1,65
1384483980.0,"15/11 03-53",19.1,65
1384484100.0,"15/11 03-55",19.1,65
1384484220.0,"15/11 03-57",19.1,65
1384484340.0,"15/11 03-59",19.1,65
1384484460.0,"15/11 04-01",19.1,65
1384484580.0,"15/11 04-03",19.1,65
1384484700.0,"15/11 04-05",19.0,65
1384484820.0,"15/11 04-07",19.0,65
1384484940.0,"15/11 04-09",19.0,65
1384485060.0,"15/11 04-11",19.0,65
1384485180.0,"15/11 04-13",19.0,65
1384485300.0,"15/11 04-15",19.0,65
1384485420.0,"15/11 04-17",19.0,65
1384485540.0,"15/11 04-19",19.0,65
1384485660.0,"15/11 04-21",19.0,65
1384485780.0,"15/11 04-23",19.0,65
1384485900.0,"15/11 04-25",19.0,65
1384486020.0,"15/11 04-27",19.0,65
1384486140.0,"15/11 04-29",19.0,65
1384486260.0,"15/11 04-31",19.0,65
1384486380.0,"15/11 04-33",19.0,65
1384486500.0,"15/11 04-35",19.0,65
1384486620.0,"15/11 04-37",19.0,65
1384486740.0,"15/11 04-39",19.0,65
1384486860.0,"15/11 04-41",19.0,65
1384486980.0,"15/11 04-43",19.0,65
1384487100.0,"15/11 04-45",19.0,65
1384487220.0,"15/11 04-47",19.0,65
1384487340.0,"15/11 04-49",19.0,65
1384487460.0,"15/11 04-51",19.0,65
1384487580.0,"15/11 04-53",19.0,65
1384487700.0,"15/11 04-55",19.0,65
1384487820.0,"15/11 04-57",19.0,65
1384487940.0,"15/11 04-59",19.1,65
1384488060.0,"15/11 05-01",19.1,65
1384488180.0,"15/11 05-03",19.1,65
1384488300.0,"15/11 05-05",19.1,65
1384488420.0,"15/11 05-07",19.1,65
1384488540.0,"15/11 05-09",19.2,65
1384488660.0,"15/11 05-11",19.2,65
1384488780.0,"15/11 05-13",19.2,66
1384488900.0,"15/11 05-15",19.3,66
1384489020.0,"15/11 05-17",19.3,66
1384489140.0,"15/11 05-19",19.4,66
1384489260.0,"15/11 05-21",19.4,66
1384489380.0,"15/11 05-23",19.5,66
1384489500.0,"15/11 05-25",19.5,66
1384489620.0,"15/11 05-27",19.6,66
1384489740.0,"15/11 05-29",19.6,66
1384489860.0,"15/11 05-31",19.6,66
1384489980.0,"15/11 05-33",19.7,66
1384490100.0,"15/11 05-35",19.7,66
1384490220.0,"15/11 05-37",19.7,66
1384490340.0,"15/11 05-39",19.7,66
1384490460.0,"15/11 05-41",19.8,66
1384490580.0,"15/11 05-43",19.8,66
1384490700.0,"15/11 05-45",19.8,66
1384490820.0,"15/11 05-47",19.8,66
1384490940.0,"15/11 05-49",19.8,66
1384491060.0,"15/11 05-51",19.8,66
1384491180.0,"15/11 05-53",19.8,65
1384491300.0,"15/11 05-55",19.8,65
1384491420.0,"15/11 05-57",19.8,65
1384491540.0,"15/11 05-59",19.8,65
1384491660.0,"15/11 06-01",19.8,65
1384491780.0,"15/11 06-03",19.9,65
1384491900.0,"15/11 06-05",19.9,65
1384492020.0,"15/11 06-07",19.9,65
1384492140.0,"15/11 06-09",19.9,65
1384492260.0,"15/11 06-11",19.9,65
1384492380.0,"15/11 06-13",19.9,65
1384492500.0,"15/11 06-15",19.9,65
1384492620.0,"15/11 06-17",19.9,65
1384492740.0,"15/11 06-19",19.9,65
1384492860.0,"15/11 06-21",19.9,64
1384492980.0,"15/11 06-23",19.9,64
1384493100.0,"15/11 06-25",19.9,64
1384493220.0,"15/11 06-27",19.9,64
1384493340.0,"15/11 06-29",20.0,63
1384493460.0,"15/11 06-31",20.0,63
1384493580.0,"15/11 06-33",20.0,63
1384493700.0,"15/11 06-35",20.0,63
1384493820.0,"15/11 06-37",20.0,63
1384493940.0,"15/11 06-39",20.0,63
1384494060.0,"15/11 06-41",20.0,63
1384494180.0,"15/11 06-43",20.0,63
1384494300.0,"15/11 06-45",20.0,63
1384494420.0,"15/11 06-47",20.0,63
1384494540.0,"15/11 06-49",20.0,63
1384494660.0,"15/11 06-51",20.0,63
1384494780.0,"15/11 06-53",20.0,63
1384494900.0,"15/11 06-55",20.1,63
1384495020.0,"15/11 06-57",20.1,63
1384495140.0,"15/11 06-59",20.1,63
1384495260.0,"15/11 07-01",20.1,63
1384495380.0,"15/11 07-03",20.1,63
1384495500.0,"15/11 07-05",20.1,63
1384495620.0,"15/11 07-07",20.1,63
1384495740.0,"15/11 07-09",20.1,63
1384495860.0,"15/11 07-11",20.1,63
1384495980.0,"15/11 07-13",20.1,63
1384496100.0,"15/11 07-15",20.1,63
1384496220.0,"15/11 07-17",20.1,63
1384496340.0,"15/11 07-19",20.1,63
1384496460.0,"15/11 07-21",20.1,63
1384496580.0,"15/11 07-23",20.1,63
1384496700.0,"15/11 07-25",20.1,63
1384496820.0,"15/11 07-27",20.2,63
1384496940.0,"15/11 07-29",20.2,64
1384497060.0,"15/11 07-31",20.2,64
1384497180.0,"15/11 07-33",20.3,64
1384497300.0,"15/11 07-35",20.3,64
1384497420.0,"15/11 07-37",20.3,64
1384497540.0,"15/11 07-39",20.3,64
1384497660.0,"15/11 07-41",20.3,64
1384497780.0,"15/11 07-43",20.3,64
1384497900.0,"15/11 07-45",20.3,64
1384498020.0,"15/11 07-47",20.3,64
1384498140.0,"15/11 07-49",20.3,64
1384498260.0,"15/11 07-51",20.3,64
1384498380.0,"15/11 07-53",20.3,64
1384498500.0,"15/11 07-55",20.3,64
1384498620.0,"15/11 07-57",20.3,64
1384498740.0,"15/11 07-59",20.3,64
1384498860.0,"15/11 08-01",20.3,64
1384498980.0,"15/11 08-03",20.3,64
1384499100.0,"15/11 08-05",20.3,64
1384499220.0,"15/11 08-07",20.3,64
1384499340.0,"15/11 08-09",20.3,64
1384499460.0,"15/11 08-11",20.3,64
1384499580.0,"15/11 08-13",20.3,63
1384499700.0,"15/11 08-15",20.3,63
1384499820.0,"15/11 08-17",20.3,63
1384499940.0,"15/11 08-19",20.3,63
1384500060.0,"15/11 08-21",20.3,63
1384500180.0,"15/11 08-23",20.2,62
1384500300.0,"15/11 08-25",20.1,62
1384500420.0,"15/11 08-27",20.1,61
1384500540.0,"15/11 08-29",20.1,61
1384500660.0,"15/11 08-31",20.1,61
1384500780.0,"15/11 08-33",20.1,61
1384500900.0,"15/11 08-35",20.1,60
1384501020.0,"15/11 08-37",20.0,60
1384501140.0,"15/11 08-39",20.0,60
1384501260.0,"15/11 08-41",20.0,60
1384501380.0,"15/11 08-43",20.0,60
1384501500.0,"15/11 08-45",20.0,60
1384501620.0,"15/11 08-47",19.9,61
1384501740.0,"15/11 08-49",19.9,61
1384501860.0,"15/11 08-51",19.9,61
1384501980.0,"15/11 08-53",19.9,61
1384502100.0,"15/11 08-55",19.8,61
1384502220.0,"15/11 08-57",19.8,61
1384502340.0,"15/11 08-59",19.8,61
1384502460.0,"15/11 09-01",19.8,61
1384502580.0,"15/11 09-03",19.8,61
1384502700.0,"15/11 09-05",19.8,61
1384502820.0,"15/11 09-07",19.7,61
1384502940.0,"15/11 09-09",19.7,61
1384503060.0,"15/11 09-11",19.7,61
1384503180.0,"15/11 09-13",19.7,61
1384503300.0,"15/11 09-15",19.7,61
1384503420.0,"15/11 09-17",19.6,61
1384503540.0,"15/11 09-19",19.6,61
1384503660.0,"15/11 09-21",19.6,60
1384503780.0,"15/11 09-23",19.6,60
1384503900.0,"15/11 09-25",19.6,60
1384504020.0,"15/11 09-27",19.5,60
1384504140.0,"15/11 09-29",19.5,60
1384504260.0,"15/11 09-31",19.5,60
1384504380.0,"15/11 09-33",19.5,60
1384504500.0,"15/11 09-35",19.5,60
1384504620.0,"15/11 09-37",19.5,60
1384504740.0,"15/11 09-39",19.5,60
1384504860.0,"15/11 09-41",19.5,60
1384504980.0,"15/11 09-43",19.4,60
1384505100.0,"15/11 09-45",19.4,60
1384505220.0,"15/11 09-47",19.4,60
1384505340.0,"15/11 09-49",19.4,60
1384505460.0,"15/11 09-51",19.4,60
1384505580.0,"15/11 09-53",19.4,60
1384505700.0,"15/11 09-55",19.4,60
1384505820.0,"15/11 09-57",19.4,60
1384505940.0,"15/11 09-59",19.3,60
1384506060.0,"15/11 10-01",19.3,60
1384506180.0,"15/11 10-03",19.3,60
1384506300.0,"15/11 10-05",19.3,60
1384506420.0,"15/11 10-07",19.3,60
1384506540.0,"15/11 10-09",19.3,60
1384506660.0,"15/11 10-11",19.3,60
1384506780.0,"15/11 10-13",19.2,60
1384506900.0,"15/11 10-15",19.2,60
1384507020.0,"15/11 10-17",19.2,60
1384507140.0,"15/11 10-19",19.2,60
1384507260.0,"15/11 10-21",19.2,60
1384507380.0,"15/11 10-23",19.2,60
1384507500.0,"15/11 10-25",19.2,60
1384507620.0,"15/11 10-27",19.2,60
1384507740.0,"15/11 10-29",19.2,60
1384507860.0,"15/11 10-31",19.2,60
1384507980.0,"15/11 10-33",19.1,60
1384508100.0,"15/11 10-35",19.1,60
1384508220.0,"15/11 10-37",19.1,60
1384508340.0,"15/11 10-39",19.1,60
1384508460.0,"15/11 10-41",19.1,60
1384508580.0,"15/11 10-43",19.1,59
1384508700.0,"15/11 10-45",19.1,59
1384508820.0,"15/11 10-47",19.1,59
1384508940.0,"15/11 10-49",19.1,59
1384509060.0,"15/11 10-51",19.0,59
1384509180.0,"15/11 10-53",19.0,59
1384509300.0,"15/11 10-55",19.0,59
1384509420.0,"15/11 10-57",19.0,59
1384509540.0,"15/11 10-59",19.0,59
1384509660.0,"15/11 11-01",19.0,59
1384509780.0,"15/11 11-03",19.0,60
1384509900.0,"15/11 11-05",19.0,60
1384510020.0,"15/11 11-07",19.0,60
1384510140.0,"15/11 11-09",19.0,60
1384510260.0,"15/11 11-11",19.0,60
1384510380.0,"15/11 11-13",19.0,60
1384510500.0,"15/11 11-15",19.0,60
1384510620.0,"15/11 11-17",19.0,60
1384510740.0,"15/11 11-19",19.0,60
1384510860.0,"15/11 11-21",18.9,61
1384510980.0,"15/11 11-23",18.9,61
1384511100.0,"15/11 11-25",18.9,61
1384511220.0,"15/11 11-27",18.9,61
1384511340.0,"15/11 11-29",18.9,61
1384511460.0,"15/11 11-31",18.9,61
1384511580.0,"15/11 11-33",18.9,61
1384511700.0,"15/11 11-35",18.9,61
1384511820.0,"15/11 11-37",18.9,61
1384511940.0,"15/11 11-39",18.9,61
1384512060.0,"15/11 11-41",18.9,61
1384512180.0,"15/11 11-43",18.9,61
1384512300.0,"15/11 11-45",18.9,61
1384512420.0,"15/11 11-47",18.9,61
1384512540.0,"15/11 11-49",18.9,61
1384512660.0,"15/11 11-51",18.9,61
1384512780.0,"15/11 11-53",18.9,61
1384512900.0,"15/11 11-55",18.9,61
1384513020.0,"15/11 11-57",18.9,61
1384513140.0,"15/11 11-59",18.9,61
1384513260.0,"15/11 12-01",18.9,61
1384513380.0,"15/11 12-03",18.9,61
1384513500.0,"15/11 12-05",18.9,61
1384513620.0,"15/11 12-07",18.9,61
1384513740.0,"15/11 12-09",18.9,61
1384513860.0,"15/11 12-11",18.9,61
1384513980.0,"15/11 12-13",18.9,61
1384514100.0,"15/11 12-15",18.9,61
1384514220.0,"15/11 12-17",18.9,61
1384514340.0,"15/11 12-19",18.9,61
1384514460.0,"15/11 12-21",18.9,61
1384514580.0,"15/11 12-23",18.8,61
1384514700.0,"15/11 12-25",18.8,61
1384514820.0,"15/11 12-27",18.8,61
1384514940.0,"15/11 12-29",18.8,61
1384515060.0,"15/11 12-31",18.8,61
1384515180.0,"15/11 12-33",18.8,61
1384515300.0,"15/11 12-35",18.8,61
1384515420.0,"15/11 12-37",18.8,61
1384515540.0,"15/11 12-39",18.8,61
1384515660.0,"15/11 12-41",18.8,60
1384515780.0,"15/11 12-43",18.8,60
1384515900.0,"15/11 12-45",18.8,60
1384516020.0,"15/11 12-47",18.8,60
1384516140.0,"15/11 12-49",18.7,60
1384516260.0,"15/11 12-51",18.7,60
1384516380.0,"15/11 12-53",18.7,60
1384516500.0,"15/11 12-55",18.7,60
1384516620.0,"15/11 12-57",18.7,61
1384516740.0,"15/11 12-59",18.7,61
1384516860.0,"15/11 13-01",18.7,61
1384516980.0,"15/11 13-03",18.7,60
1384517100.0,"15/11 13-05",18.7,60
1384517220.0,"15/11 13-07",18.7,60
1384517340.0,"15/11 13-09",18.7,60
1384517460.0,"15/11 13-11",18.7,60
1384517580.0,"15/11 13-13",18.7,60
1384517700.0,"15/11 13-15",18.7,60
1384517820.0,"15/11 13-17",18.7,60
1384517940.0,"15/11 13-19",18.7,60
1384518060.0,"15/11 13-21",18.7,60
1384518180.0,"15/11 13-23",18.7,60
1384518300.0,"15/11 13-25",18.6,60
1384518420.0,"15/11 13-27",18.6,60
1384518540.0,"15/11 13-29",18.6,60
1384518660.0,"15/11 13-31",18.6,60
1384518780.0,"15/11 13-33",18.6,60
1384518900.0,"15/11 13-35",18.6,60
1384519020.0,"15/11 13-37",18.6,60
1384519140.0,"15/11 13-39",18.6,60
1384519260.0,"15/11 13-41",18.6,60
1384519380.0,"15/11 13-43",18.6,60
1384519500.0,"15/11 13-45",18.6,60
1384519620.0,"15/11 13-47",18.6,60
1384519740.0,"15/11 13-49",18.6,60
1384519860.0,"15/11 13-51",18.6,60
1384519980.0,"15/11 13-53",18.6,60
1384520100.0,"15/11 13-55",18.5,60
1384520220.0,"15/11 13-57",18.5,60
1384520340.0,"15/11 13-59",18.5,60
1384520460.0,"15/11 14-01",18.5,60
1384520580.0,"15/11 14-03",18.5,60
1384520700.0,"15/11 14-05",18.5,60
1384520820.0,"15/11 14-07",18.5,60
1384520940.0,"15/11 14-09",18.5,60
1384521060.0,"15/11 14-11",18.5,60
1384521180.0,"15/11 14-13",18.5,60
1384521300.0,"15/11 14-15",18.5,60
1384521420.0,"15/11 14-17",18.5,60
1384521540.0,"15/11 14-19",18.5,60
1384521660.0,"15/11 14-21",18.5,60
1384521780.0,"15/11 14-23",18.5,60
1384521900.0,"15/11 14-25",18.5,60
1384522020.0,"15/11 14-27",18.5,60
1384522140.0,"15/11 14-29",18.5,61
1384522260.0,"15/11 14-31",18.5,60
1384522380.0,"15/11 14-33",18.5,60
1384522500.0,"15/11 14-35",18.5,60
1384522620.0,"15/11 14-37",18.5,60
1384522740.0,"15/11 14-39",18.5,61
1384522860.0,"15/11 14-41",18.5,61
1384522980.0,"15/11 14-43",18.5,61
1384523100.0,"15/11 14-45",18.5,60
1384523220.0,"15/11 14-47",18.5,60
1384523340.0,"15/11 14-49",18.5,60
1384523460.0,"15/11 14-51",18.5,60
1384523580.0,"15/11 14-53",18.5,60
1384523700.0,"15/11 14-55",18.5,61
1384523820.0,"15/11 14-57",18.5,61
1384523940.0,"15/11 14-59",18.5,61
1384524060.0,"15/11 15-01",18.5,61
1384524180.0,"15/11 15-03",18.4,61
1384524300.0,"15/11 15-05",18.4,61
1384524420.0,"15/11 15-07",18.4,61
1384524540.0,"15/11 15-09",18.4,61
1384524660.0,"15/11 15-11",18.4,61
1384524780.0,"15/11 15-13",18.4,61
1384524900.0,"15/11 15-15",18.4,61
1384525020.0,"15/11 15-17",18.4,61
1384525140.0,"15/11 15-19",18.4,61
1384525260.0,"15/11 15-21",18.4,61
1384525380.0,"15/11 15-23",18.4,61
1384525500.0,"15/11 15-25",18.4,61
1384525620.0,"15/11 15-27",18.4,61
1384525740.0,"15/11 15-29",18.4,61
1384525860.0,"15/11 15-31",18.4,61
1384525980.0,"15/11 15-33",18.4,61
1384526100.0,"15/11 15-35",18.4,61
1384526220.0,"15/11 15-37",18.4,61
1384526340.0,"15/11 15-39",18.3,61
1384526460.0,"15/11 15-41",18.3,61
1384526580.0,"15/11 15-43",18.3,61
1384526700.0,"15/11 15-45",18.3,61
1384526820.0,"15/11 15-47",18.3,61
1384526940.0,"15/11 15-49",18.3,61
1384527060.0,"15/11 15-51",18.3,61
1384527180.0,"15/11 15-53",18.3,61
1384527300.0,"15/11 15-55",18.3,61
1384527420.0,"15/11 15-57",18.3,61
1384527540.0,"15/11 15-59",18.3,61
1384527660.0,"15/11 16-01",18.3,61
1384527780.0,"15/11 16-03",18.3,61
1384527900.0,"15/11 16-05",18.3,61
1384528020.0,"15/11 16-07",18.3,61
1384528140.0,"15/11 16-09",18.3,61
1384528260.0,"15/11 16-11",18.3,61
1384528380.0,"15/11 16-13",18.3,61
1384528500.0,"15/11 16-15",18.2,61
1384528620.0,"15/11 16-17",18.2,61
1384528740.0,"15/11 16-19",18.2,61
1384528860.0,"15/11 16-21",18.2,61
1384528980.0,"15/11 16-23",18.2,61
1384529100.0,"15/11 16-25",18.2,61
1384529220.0,"15/11 16-27",18.2,61
1384529340.0,"15/11 16-29",18.2,61
1384529460.0,"15/11 16-31",18.2,61
1384529580.0,"15/11 16-33",18.2,61
1384529700.0,"15/11 16-35",18.2,61
1384529820.0,"15/11 16-37",18.2,61
1384529940.0,"15/11 16-39",18.2,61
1384530060.0,"15/11 16-41",18.2,61
1384530180.0,"15/11 16-43",18.2,61
1384530300.0,"15/11 16-45",18.2,61
1384530420.0,"15/11 16-47",18.2,61
1384530540.0,"15/11 16-49",18.2,61
1384530660.0,"15/11 16-51",18.2,61
1384530780.0,"15/11 16-53",18.2,61
1384530900.0,"15/11 16-55",18.2,61
1384531020.0,"15/11 16-57",18.2,61
1384531140.0,"15/11 16-59",18.2,61
1384531260.0,"15/11 17-01",18.2,61
1384531380.0,"15/11 17-03",18.2,61
1384531500.0,"15/11 17-05",18.2,61
1384531620.0,"15/11 17-07",18.2,61
1384531740.0,"15/11 17-09",18.2,61
1384531860.0,"15/11 17-11",18.2,62
1384531980.0,"15/11 17-13",18.2,62
1384532100.0,"15/11 17-15",18.2,62
1384532220.0,"15/11 17-17",18.3,62
1384532340.0,"15/11 17-19",18.3,62
1384532460.0,"15/11 17-21",18.4,62
1384532580.0,"15/11 17-23",18.4,62
1384532700.0,"15/11 17-25",18.4,62
1384532820.0,"15/11 17-27",18.4,62
1384532940.0,"15/11 17-29",18.4,62
1384533060.0,"15/11 17-31",18.5,62
1384533180.0,"15/11 17-33",18.5,62
1384533300.0,"15/11 17-35",18.5,62
1384533420.0,"15/11 17-37",18.5,62
1384533540.0,"15/11 17-39",18.6,62
1384533660.0,"15/11 17-41",18.6,62
1384533780.0,"15/11 17-43",18.6,62
1384533900.0,"15/11 17-45",18.6,62
1384534020.0,"15/11 17-47",18.7,62
1384534140.0,"15/11 17-49",18.7,62
1384534260.0,"15/11 17-51",18.7,62
1384534380.0,"15/11 17-53",18.7,62
1384534500.0,"15/11 17-55",18.7,62
1384534620.0,"15/11 17-57",18.8,62
1384534740.0,"15/11 17-59",18.8,62
1384534860.0,"15/11 18-01",18.8,62
1384534980.0,"15/11 18-03",18.8,62
1384535100.0,"15/11 18-05",18.8,62
1384535220.0,"15/11 18-07",18.9,62
1384535340.0,"15/11 18-09",18.9,62
1384535460.0,"15/11 18-11",18.9,62
1384535580.0,"15/11 18-13",18.9,62
1384535700.0,"15/11 18-15",19.0,61
1384535820.0,"15/11 18-17",19.0,61
1384535940.0,"15/11 18-19",19.0,61
1384536060.0,"15/11 18-21",19.0,61
1384536180.0,"15/11 18-23",19.1,61
1384536300.0,"15/11 18-25",19.1,61
1384536420.0,"15/11 18-27",19.1,61
1384536540.0,"15/11 18-29",19.1,61
1384536660.0,"15/11 18-31",19.1,61
1384536780.0,"15/11 18-33",19.2,61
1384536900.0,"15/11 18-35",19.2,61
1384537020.0,"15/11 18-37",19.3,61
1384537140.0,"15/11 18-39",19.3,62
1384537260.0,"15/11 18-41",19.4,61
1384537380.0,"15/11 18-43",19.4,61
1384537500.0,"15/11 18-45",19.4,61
1384537620.0,"15/11 18-47",19.4,61
1384537740.0,"15/11 18-49",19.5,61
1384537860.0,"15/11 18-51",19.5,61
1384537980.0,"15/11 18-53",19.5,61
1384538100.0,"15/11 18-55",19.5,62
1384538220.0,"15/11 18-57",19.6,62
1384538340.0,"15/11 18-59",19.6,62
1384538460.0,"15/11 19-01",19.6,62
1384538580.0,"15/11 19-03",19.6,62
1384538700.0,"15/11 19-05",19.6,62
1384538820.0,"15/11 19-07",19.7,62
1384538940.0,"15/11 19-09",19.7,62
1384539060.0,"15/11 19-11",19.7,62
1384539180.0,"15/11 19-13",19.7,62
1384539300.0,"15/11 19-15",19.8,62
1384539420.0,"15/11 19-17",19.8,62
1384539540.0,"15/11 19-19",19.8,62
1384539660.0,"15/11 19-21",19.9,62
1384539780.0,"15/11 19-23",19.9,62
1384539900.0,"15/11 19-25",19.9,62
1384540020.0,"15/11 19-27",20.0,61
1384540140.0,"15/11 19-29",20.0,62
1384540260.0,"15/11 19-31",20.0,62
1384540380.0,"15/11 19-33",20.1,62
1384540500.0,"15/11 19-35",20.1,62
1384540620.0,"15/11 19-37",20.1,62
1384540740.0,"15/11 19-39",20.1,63
1384540860.0,"15/11 19-41",20.1,63
1384540980.0,"15/11 19-43",20.2,62
1384541100.0,"15/11 19-45",20.2,62
1384541220.0,"15/11 19-47",20.2,62
1384541340.0,"15/11 19-49",20.2,62
1384541460.0,"15/11 19-51",20.2,62
1384541580.0,"15/11 19-53",20.2,62
1384541700.0,"15/11 19-55",20.2,62
1384541820.0,"15/11 19-57",20.2,62
1384541940.0,"15/11 19-59",20.3,62
1384542060.0,"15/11 20-01",20.3,62
1384542180.0,"15/11 20-03",20.3,62
1384542300.0,"15/11 20-05",20.3,62
1384542420.0,"15/11 20-07",20.3,62
1384542540.0,"15/11 20-09",20.3,62
1384542660.0,"15/11 20-11",20.4,62
1384542780.0,"15/11 20-13",20.4,62
1384542900.0,"15/11 20-15",20.4,62
1384543020.0,"15/11 20-17",20.4,63
1384543140.0,"15/11 20-19",20.4,63
1384543260.0,"15/11 20-21",20.4,63
1384543380.0,"15/11 20-23",20.4,63
1384543500.0,"15/11 20-25",20.4,63
1384543620.0,"15/11 20-27",20.4,63
1384543740.0,"15/11 20-29",20.4,63
1384543860.0,"15/11 20-31",20.5,63
1384543980.0,"15/11 20-33",20.5,63
1384544100.0,"15/11 20-35",20.5,63
1384544220.0,"15/11 20-37",20.5,63
1384544340.0,"15/11 20-39",20.5,63
1384544460.0,"15/11 20-41",20.5,63
1384544580.0,"15/11 20-43",20.5,63
1384544700.0,"15/11 20-45",20.5,63
1384544820.0,"15/11 20-47",20.6,63
1384544940.0,"15/11 20-49",20.6,63
1384545060.0,"15/11 20-51",20.6,63
1384545180.0,"15/11 20-53",20.6,63
1384545300.0,"15/11 20-55",20.6,63
1384545420.0,"15/11 20-57",20.6,63
1384545540.0,"15/11 20-59",20.6,63
1384545660.0,"15/11 21-01",20.6,63
1384545780.0,"15/11 21-03",20.6,63
1384545900.0,"15/11 21-05",20.6,63
1384546020.0,"15/11 21-07",20.6,63
1384546140.0,"15/11 21-09",20.6,63
1384546260.0,"15/11 21-11",20.6,63
1384546380.0,"15/11 21-13",20.6,63
1384546500.0,"15/11 21-15",20.6,63
1384546620.0,"15/11 21-17",20.6,63
1384546740.0,"15/11 21-19",20.6,63
1384546860.0,"15/11 21-21",20.6,63
1384546980.0,"15/11 21-23",20.6,63
1384547100.0,"15/11 21-25",20.6,63
1384547220.0,"15/11 21-27",20.6,63
1384547340.0,"15/11 21-29",20.6,63
1384547460.0,"15/11 21-31",20.6,63
1384547580.0,"15/11 21-33",20.7,63
1384547700.0,"15/11 21-35",20.6,63
1384547820.0,"15/11 21-37",20.7,63
1384547940.0,"15/11 21-39",20.7,63
1384548060.0,"15/11 21-41",20.7,63
1384548180.0,"15/11 21-43",20.7,63
1384548300.0,"15/11 21-45",20.7,63
1384548420.0,"15/11 21-47",20.7,63
1384548540.0,"15/11 21-49",20.7,63
1384548660.0,"15/11 21-51",20.7,63
1384548780.0,"15/11 21-53",20.7,63
1384548900.0,"15/11 21-55",20.7,63
1384549020.0,"15/11 21-57",20.7,63
1384549140.0,"15/11 21-59",20.7,63
1384549260.0,"15/11 22-01",20.7,63
1384549380.0,"15/11 22-03",20.7,63
1384549500.0,"15/11 22-05",20.7,63
1384549620.0,"15/11 22-07",20.7,63
1384549740.0,"15/11 22-09",20.7,63
1384549860.0,"15/11 22-11",20.7,63
1384549980.0,"15/11 22-13",20.7,63
1384550100.0,"15/11 22-15",20.7,63
1384550220.0,"15/11 22-17",20.7,63
1384550340.0,"15/11 22-19",20.7,63
1384550460.0,"15/11 22-21",20.7,63
1384550580.0,"15/11 22-23",20.7,63
1384550700.0,"15/11 22-25",20.7,63
1384550820.0,"15/11 22-27",20.7,63
1384550940.0,"15/11 22-29",20.7,63
1384551060.0,"15/11 22-31",20.7,63
1384551180.0,"15/11 22-33",20.6,63
1384551300.0,"15/11 22-35",20.6,63
1384551420.0,"15/11 22-37",20.6,63
1384551540.0,"15/11 22-39",20.6,63
1384551660.0,"15/11 22-41",20.6,63
1384551780.0,"15/11 22-43",20.6,63
1384551900.0,"15/11 22-45",20.6,63
1384552020.0,"15/11 22-47",20.6,63
1384552140.0,"15/11 22-49",20.6,63
1384552260.0,"15/11 22-51",20.6,63
1384552380.0,"15/11 22-53",20.5,63
1384552500.0,"15/11 22-55",20.5,63
1384552620.0,"15/11 22-57",20.5,63
1384552740.0,"15/11 22-59",20.5,63
1384552860.0,"15/11 23-01",20.5,63
1384552980.0,"15/11 23-03",20.5,63
1384553100.0,"15/11 23-05",20.5,63
1384553220.0,"15/11 23-07",20.5,63
1384553340.0,"15/11 23-09",20.5,63
1384553460.0,"15/11 23-11",20.5,63
1384553580.0,"15/11 23-13",20.5,63
1384553700.0,"15/11 23-15",20.5,63
1384553820.0,"15/11 23-17",20.5,63
1384553940.0,"15/11 23-19",20.5,64
1384554060.0,"15/11 23-21",20.6,64
1384554180.0,"15/11 23-23",20.6,64
1384554300.0,"15/11 23-25",20.6,64
1384554420.0,"15/11 23-27",20.6,64
1384554540.0,"15/11 23-29",20.7,64
1384554660.0,"15/11 23-31",20.7,64
1384554780.0,"15/11 23-33",20.7,64
1384554900.0,"15/11 23-35",20.7,64
1384555020.0,"15/11 23-37",20.7,64
1384555140.0,"15/11 23-39",20.7,64
1384555260.0,"15/11 23-41",20.7,65
1384555380.0,"15/11 23-43",20.7,65
1384555500.0,"15/11 23-45",20.7,65
1384555620.0,"15/11 23-47",20.7,65
1384555740.0,"15/11 23-49",20.9,65
1384555860.0,"15/11 23-51",20.9,65
1384555980.0,"15/11 23-53",20.8,65
1384556100.0,"15/11 23-55",20.8,65
1384556220.0,"15/11 23-57",20.7,64
1384556340.0,"15/11 23-59",20.7,64
1384556460.0,"16/11 00-01",20.7,64
1384556580.0,"16/11 00-03",20.6,64
1384556700.0,"16/11 00-05",20.6,64
1384556820.0,"16/11 00-07",20.6,64
1384556940.0,"16/11 00-09",20.5,64
1384557060.0,"16/11 00-11",20.5,64
1384557180.0,"16/11 00-13",20.5,64
1384557300.0,"16/11 00-15",20.5,64
1384557420.0,"16/11 00-17",20.4,64
1384557540.0,"16/11 00-19",20.4,64
1384557660.0,"16/11 00-21",20.4,64
1384557780.0,"16/11 00-23",20.4,64
1384557900.0,"16/11 00-25",20.4,64
1384558020.0,"16/11 00-27",20.4,64
1384558140.0,"16/11 00-29",20.4,64
1384558260.0,"16/11 00-31",20.4,64
1384558380.0,"16/11 00-33",20.4,64
1384558500.0,"16/11 00-35",20.4,64
1384558620.0,"16/11 00-37",20.3,64
1384558740.0,"16/11 00-39",20.3,64
1384558860.0,"16/11 00-41",20.3,64
1384558980.0,"16/11 00-43",20.3,64
1384559100.0,"16/11 00-45",20.3,64
1384559220.0,"16/11 00-47",20.3,64
1384559340.0,"16/11 00-49",20.3,64
1384559460.0,"16/11 00-51",20.2,64
1384559580.0,"16/11 00-53",20.2,64
1384559700.0,"16/11 00-55",20.2,64
1384559820.0,"16/11 00-57",20.2,64
1384559940.0,"16/11 00-59",20.2,64
1384560060.0,"16/11 01-01",20.2,64
1384560180.0,"16/11 01-03",20.2,64
1384560300.0,"16/11 01-05",20.2,64
1384560420.0,"16/11 01-07",20.2,64
1384560540.0,"16/11 01-09",20.2,64
1384560660.0,"16/11 01-11",20.2,64
1384560780.0,"16/11 01-13",20.2,64
1384560900.0,"16/11 01-15",20.2,64
1384561020.0,"16/11 01-17",20.2,64
1384561140.0,"16/11 01-19",20.2,64
1384561260.0,"16/11 01-21",20.2,64
1384561380.0,"16/11 01-23",20.1,64
1384561500.0,"16/11 01-25",20.1,64
1384561620.0,"16/11 01-27",20.1,64
1384561740.0,"16/11 01-29",20.1,64
1384561860.0,"16/11 01-31",20.1,64
1384561980.0,"16/11 01-33",20.1,64
1384562100.0,"16/11 01-35",20.1,64
1384562220.0,"16/11 01-37",20.1,64
1384562340.0,"16/11 01-39",20.1,64
1384562460.0,"16/11 01-41",20.1,64
1384562580.0,"16/11 01-43",20.1,64
1384562700.0,"16/11 01-45",20.1,64
1384562820.0,"16/11 01-47",20.1,64
1384562940.0,"16/11 01-49",20.1,64
1384563060.0,"16/11 01-51",20.1,64
1384563180.0,"16/11 01-53",20.1,64
1384563300.0,"16/11 01-55",20.1,64
1384563420.0,"16/11 01-57",20.1,64
1384563540.0,"16/11 01-59",20.1,64
1384563660.0,"16/11 02-01",20.1,64
1384563780.0,"16/11 02-03",20.1,64
1384563900.0,"16/11 02-05",20.1,64
1384564020.0,"16/11 02-07",20.1,64
1384564140.0,"16/11 02-09",20.0,64
1384564260.0,"16/11 02-11",20.0,64
1384564380.0,"16/11 02-13",20.0,64
1384564500.0,"16/11 02-15",20.0,64
1384564620.0,"16/11 02-17",20.0,64
1384564740.0,"16/11 02-19",20.0,64
1384564860.0,"16/11 02-21",20.0,64
1384564980.0,"16/11 02-23",20.0,64
1384565100.0,"16/11 02-25",20.0,64
1384565220.0,"16/11 02-27",20.0,64
1384565340.0,"16/11 02-29",20.0,64
1384565460.0,"16/11 02-31",20.0,64
1384565580.0,"16/11 02-33",20.0,64
1384565700.0,"16/11 02-35",20.0,64
1384565820.0,"16/11 02-37",20.0,64
1384565940.0,"16/11 02-39",20.0,64
1384566060.0,"16/11 02-41",20.0,64
1384566180.0,"16/11 02-43",20.0,64
1384566300.0,"16/11 02-45",20.0,64
1384566420.0,"16/11 02-47",20.0,64
1384566540.0,"16/11 02-49",19.9,65
1384566660.0,"16/11 02-51",19.9,65
1384566780.0,"16/11 02-53",19.9,65
1384566900.0,"16/11 02-55",19.9,65
1384567020.0,"16/11 02-57",19.9,65
1384567140.0,"16/11 02-59",19.9,65
1384567260.0,"16/11 03-01",19.9,65
1384567380.0,"16/11 03-03",19.9,65
1384567500.0,"16/11 03-05",19.9,65
1384567620.0,"16/11 03-07",19.9,65
1384567740.0,"16/11 03-09",19.9,65
1384567860.0,"16/11 03-11",19.9,65
1384567980.0,"16/11 03-13",19.9,65
1384568100.0,"16/11 03-15",19.9,65
1384568220.0,"16/11 03-17",19.9,65
1384568340.0,"16/11 03-19",19.9,65
1384568460.0,"16/11 03-21",19.9,65
1384568580.0,"16/11 03-23",19.9,65
1384568700.0,"16/11 03-25",19.9,65
1384568820.0,"16/11 03-27",19.9,65
1384568940.0,"16/11 03-29",19.9,65
1384569060.0,"16/11 03-31",19.9,65
1384569180.0,"16/11 03-33",19.8,65
1384569300.0,"16/11 03-35",19.8,65
1384569420.0,"16/11 03-37",19.8,65
1384569540.0,"16/11 03-39",19.8,65
1384569660.0,"16/11 03-41",19.8,65
1384569780.0,"16/11 03-43",19.8,65
1384569900.0,"16/11 03-45",19.8,65
1384570020.0,"16/11 03-47",19.8,65
1384570140.0,"16/11 03-49",19.8,65
1384570260.0,"16/11 03-51",19.8,65
1384570380.0,"16/11 03-53",19.8,65
1384570500.0,"16/11 03-55",19.8,65
1384570620.0,"16/11 03-57",19.8,65
1384570740.0,"16/11 03-59",19.8,65
1384570860.0,"16/11 04-01",19.8,65
1384570980.0,"16/11 04-03",19.8,65
1384571100.0,"16/11 04-05",19.8,65
1384571220.0,"16/11 04-07",19.8,65
1384571340.0,"16/11 04-09",19.8,66
1384571460.0,"16/11 04-11",19.8,66
1384571580.0,"16/11 04-13",19.8,66
1384571700.0,"16/11 04-15",19.8,66
1384571820.0,"16/11 04-17",19.8,66
1384571940.0,"16/11 04-19",19.8,66
1384572060.0,"16/11 04-21",19.8,66
1384572180.0,"16/11 04-23",19.8,66
1384572300.0,"16/11 04-25",19.8,66
1384572420.0,"16/11 04-27",19.8,66
1384572540.0,"16/11 04-29",19.8,66
1384572660.0,"16/11 04-31",19.8,66
1384572780.0,"16/11 04-33",19.7,66
1384572900.0,"16/11 04-35",19.7,66
1384573020.0,"16/11 04-37",19.7,66
1384573140.0,"16/11 04-39",19.7,66
1384573260.0,"16/11 04-41",19.7,66
1384573380.0,"16/11 04-43",19.7,66
1384573500.0,"16/11 04-45",19.7,66
1384573620.0,"16/11 04-47",19.7,66
1384573740.0,"16/11 04-49",19.7,66
1384573860.0,"16/11 04-51",19.7,66
1384573980.0,"16/11 04-53",19.7,66
1384574100.0,"16/11 04-55",19.7,66
1384574220.0,"16/11 04-57",19.7,66
1384574340.0,"16/11 04-59",19.7,66
1384574460.0,"16/11 05-01",19.7,66
1384574580.0,"16/11 05-03",19.7,66
1384574700.0,"16/11 05-05",19.7,66
1384574820.0,"16/11 05-07",19.7,65
1384574940.0,"16/11 05-09",19.7,65
1384575060.0,"16/11 05-11",19.6,65
1384575180.0,"16/11 05-13",19.6,65
1384575300.0,"16/11 05-15",19.6,65
1384575420.0,"16/11 05-17",19.6,65
1384575540.0,"16/11 05-19",19.6,65
1384575660.0,"16/11 05-21",19.6,65
1384575780.0,"16/11 05-23",19.6,65
1384575900.0,"16/11 05-25",19.6,65
1384576020.0,"16/11 05-27",19.6,65
1384576140.0,"16/11 05-29",19.6,65
1384576260.0,"16/11 05-31",19.6,65
1384576380.0,"16/11 05-33",19.6,65
1384576500.0,"16/11 05-35",19.6,66
1384576620.0,"16/11 05-37",19.6,66
1384576740.0,"16/11 05-39",19.6,66
1384576860.0,"16/11 05-41",19.6,66
1384576980.0,"16/11 05-43",19.6,66
1384577100.0,"16/11 05-45",19.6,66
1384577220.0,"16/11 05-47",19.6,66
1384577340.0,"16/11 05-49",19.6,66
1384577460.0,"16/11 05-51",19.6,66
1384577580.0,"16/11 05-53",19.6,66
1384577700.0,"16/11 05-55",19.6,66
1384577820.0,"16/11 05-57",19.6,66
1384577940.0,"16/11 05-59",19.6,66
1384578060.0,"16/11 06-01",19.6,66
1384578180.0,"16/11 06-03",19.6,66
1384578300.0,"16/11 06-05",19.6,66
1384578420.0,"16/11 06-07",19.6,66
1384578540.0,"16/11 06-09",19.6,66
1384578660.0,"16/11 06-11",19.6,66
1384578780.0,"16/11 06-13",19.6,66
1384578900.0,"16/11 06-15",19.6,66
1384579020.0,"16/11 06-17",19.6,66
1384579140.0,"16/11 06-19",19.7,66
1384579260.0,"16/11 06-21",19.7,66
1384579380.0,"16/11 06-23",19.7,66
1384579500.0,"16/11 06-25",19.7,66
1384579620.0,"16/11 06-27",19.7,66
1384579740.0,"16/11 06-29",19.7,66
1384579860.0,"16/11 06-31",19.7,66
1384579980.0,"16/11 06-33",19.7,66
1384580100.0,"16/11 06-35",19.7,66
1384580220.0,"16/11 06-37",19.8,66
1384580340.0,"16/11 06-39",19.8,66
1384580460.0,"16/11 06-41",19.8,66
1384580580.0,"16/11 06-43",19.8,66
1384580700.0,"16/11 06-45",19.8,66
1384580820.0,"16/11 06-47",19.8,66
1384580940.0,"16/11 06-49",19.8,66
1384581060.0,"16/11 06-51",19.9,66
1384581180.0,"16/11 06-53",19.9,66
1384581300.0,"16/11 06-55",19.9,65
1384581420.0,"16/11 06-57",19.9,65
1384581540.0,"16/11 06-59",19.9,65
1384581660.0,"16/11 07-01",19.9,65
1384581780.0,"16/11 07-03",19.9,65
1384581900.0,"16/11 07-05",20.0,64
1384582020.0,"16/11 07-07",20.0,64
1384582140.0,"16/11 07-09",20.0,64
1384582260.0,"16/11 07-11",20.0,64
1384582380.0,"16/11 07-13",20.0,64
1384582500.0,"16/11 07-15",20.0,64
1384582620.0,"16/11 07-17",20.0,64
1384582740.0,"16/11 07-19",20.0,64
1384582860.0,"16/11 07-21",20.1,64
1384582980.0,"16/11 07-23",20.1,64
1384583100.0,"16/11 07-25",20.1,64
1384583220.0,"16/11 07-27",20.1,64
1384583340.0,"16/11 07-29",20.1,64
1384583460.0,"16/11 07-31",20.1,64
1384583580.0,"16/11 07-33",20.1,64
1384583700.0,"16/11 07-35",20.1,64
1384583820.0,"16/11 07-37",20.1,64
1384583940.0,"16/11 07-39",20.1,64
1384584060.0,"16/11 07-41",20.1,64
1384584180.0,"16/11 07-43",20.1,64
1384584300.0,"16/11 07-45",20.1,64
1384584420.0,"16/11 07-47",20.2,64
1384584540.0,"16/11 07-49",20.2,64
1384584660.0,"16/11 07-51",20.2,64
1384584780.0,"16/11 07-53",20.2,64
1384584900.0,"16/11 07-55",20.2,64
1384585020.0,"16/11 07-57",20.2,64
1384585140.0,"16/11 07-59",20.2,64
1384585260.0,"16/11 08-01",20.2,64
1384585380.0,"16/11 08-03",20.2,64
1384585500.0,"16/11 08-05",20.2,64
1384585620.0,"16/11 08-07",20.2,64
1384585740.0,"16/11 08-09",20.3,64
1384585860.0,"16/11 08-11",20.3,64
1384585980.0,"16/11 08-13",20.3,64
1384586100.0,"16/11 08-15",20.3,64
1384586220.0,"16/11 08-17",20.3,64
1384586340.0,"16/11 08-19",20.3,64
1384586460.0,"16/11 08-21",20.3,64
1384586580.0,"16/11 08-23",20.3,64
1384586700.0,"16/11 08-25",20.4,64
1384586820.0,"16/11 08-27",20.4,64
1384586940.0,"16/11 08-29",20.4,65
1384587060.0,"16/11 08-31",20.4,65
1384587180.0,"16/11 08-33",20.4,65
1384587300.0,"16/11 08-35",20.4,65
1384587420.0,"16/11 08-37",20.4,65
1384587540.0,"16/11 08-39",20.4,65
1384587660.0,"16/11 08-41",20.4,65
1384587780.0,"16/11 08-43",20.4,65
1384587900.0,"16/11 08-45",20.5,65
1384588020.0,"16/11 08-47",20.5,65
1384588140.0,"16/11 08-49",20.5,65
1384588260.0,"16/11 08-51",20.5,65
1384588380.0,"16/11 08-53",20.5,65
1384588500.0,"16/11 08-55",20.5,65
1384588620.0,"16/11 08-57",20.5,65
1384588740.0,"16/11 08-59",20.5,65
1384588860.0,"16/11 09-01",20.5,65
1384588980.0,"16/11 09-03",20.5,65
1384589100.0,"16/11 09-05",20.5,65
1384589220.0,"16/11 09-07",20.5,65
1384589340.0,"16/11 09-09",20.5,65
1384589460.0,"16/11 09-11",20.6,65
1384589580.0,"16/11 09-13",20.6,65
1384589700.0,"16/11 09-15",20.6,65
1384589820.0,"16/11 09-17",20.6,65
1384589940.0,"16/11 09-19",20.6,65
1384590060.0,"16/11 09-21",20.6,64
1384590180.0,"16/11 09-23",20.7,64
1384590300.0,"16/11 09-25",20.8,64
1384590420.0,"16/11 09-27",20.8,63
1384590540.0,"16/11 09-29",20.8,63
1384590660.0,"16/11 09-31",20.8,63
1384590780.0,"16/11 09-33",20.8,63
1384590900.0,"16/11 09-35",20.8,63
1384591020.0,"16/11 09-37",20.8,63
1384591140.0,"16/11 09-39",20.8,63
1384591260.0,"16/11 09-41",20.8,63
1384591380.0,"16/11 09-43",20.8,63
1384591500.0,"16/11 09-45",20.8,62
1384591620.0,"16/11 09-47",20.8,62
1384591740.0,"16/11 09-49",20.8,62
1384591860.0,"16/11 09-51",20.8,62
1384591980.0,"16/11 09-53",20.8,62
1384592100.0,"16/11 09-55",20.8,62
1384592220.0,"16/11 09-57",20.8,62
1384592340.0,"16/11 09-59",20.8,62
1384592460.0,"16/11 10-01",20.9,62
1384592580.0,"16/11 10-03",20.9,62
1384592700.0,"16/11 10-05",20.8,62
1384592820.0,"16/11 10-07",20.8,62
1384592940.0,"16/11 10-09",20.8,62
1384593060.0,"16/11 10-11",20.8,62
1384593180.0,"16/11 10-13",20.8,62
1384593300.0,"16/11 10-15",20.8,62
1384593420.0,"16/11 10-17",20.8,62
1384593540.0,"16/11 10-19",20.8,62
1384593660.0,"16/11 10-21",20.8,62
1384593780.0,"16/11 10-23",20.8,62
1384593900.0,"16/11 10-25",20.9,62
1384594020.0,"16/11 10-27",20.8,62
1384594140.0,"16/11 10-29",20.8,62
1384594260.0,"16/11 10-31",20.8,62
1384594380.0,"16/11 10-33",20.9,62
1384594500.0,"16/11 10-35",20.9,62
1384594620.0,"16/11 10-37",20.9,62
1384594740.0,"16/11 10-39",20.9,62
1384594860.0,"16/11 10-41",20.9,62
1384594980.0,"16/11 10-43",20.9,62
1384595100.0,"16/11 10-45",20.9,62
1384595220.0,"16/11 10-47",20.9,62
1384595340.0,"16/11 10-49",20.9,62
1384595460.0,"16/11 10-51",20.9,62
1384595580.0,"16/11 10-53",20.9,62
1384595700.0,"16/11 10-55",20.9,62
1384595820.0,"16/11 10-57",20.9,62
1384595940.0,"16/11 10-59",20.9,62
1384596060.0,"16/11 11-01",20.9,62
1384596180.0,"16/11 11-03",20.9,62
1384596300.0,"16/11 11-05",20.9,62
1384596420.0,"16/11 11-07",20.9,62
1384596540.0,"16/11 11-09",20.9,62
1384596660.0,"16/11 11-11",20.9,62
1384596780.0,"16/11 11-13",20.9,61
1384596900.0,"16/11 11-15",20.9,61
1384597020.0,"16/11 11-17",20.9,61
1384597140.0,"16/11 11-19",20.9,62
1384597260.0,"16/11 11-21",20.9,62
1384597380.0,"16/11 11-23",20.9,62
1384597500.0,"16/11 11-25",20.9,62
1384597620.0,"16/11 11-27",20.9,62
1384597740.0,"16/11 11-29",20.9,62
1384597860.0,"16/11 11-31",20.9,62
1384597980.0,"16/11 11-33",20.9,62
1384598100.0,"16/11 11-35",20.9,62
1384598220.0,"16/11 11-37",20.9,62
1384598340.0,"16/11 11-39",20.9,62
1384598460.0,"16/11 11-41",20.9,62
1384598580.0,"16/11 11-43",20.9,62
1384598700.0,"16/11 11-45",20.9,62
1384598820.0,"16/11 11-47",20.9,63
1384598940.0,"16/11 11-49",20.9,63
1384599060.0,"16/11 11-51",20.9,63
1384599180.0,"16/11 11-53",20.9,63
1384599300.0,"16/11 11-55",20.9,63
1384599420.0,"16/11 11-57",20.9,63
1384599540.0,"16/11 11-59",21.0,62
1384599660.0,"16/11 12-01",21.0,62
1384599780.0,"16/11 12-03",21.0,62
1384599900.0,"16/11 12-05",21.0,62
1384600020.0,"16/11 12-07",21.0,62
1384600140.0,"16/11 12-09",21.0,62
1384600260.0,"16/11 12-11",21.0,62
1384600380.0,"16/11 12-13",21.0,62
1384600500.0,"16/11 12-15",21.0,62
1384600620.0,"16/11 12-17",21.0,62
1384600740.0,"16/11 12-19",21.1,63
1384600860.0,"16/11 12-21",21.1,63
1384600980.0,"16/11 12-23",21.1,63
1384601100.0,"16/11 12-25",21.1,63
1384601220.0,"16/11 12-27",21.1,63
1384601340.0,"16/11 12-29",21.1,63
1384601460.0,"16/11 12-31",21.1,63
1384601580.0,"16/11 12-33",21.1,63
1384601700.0,"16/11 12-35",21.1,63
1384601820.0,"16/11 12-37",21.1,64
1384601940.0,"16/11 12-39",21.2,64
1384602060.0,"16/11 12-41",21.2,64
1384602180.0,"16/11 12-43",21.2,64
1384602300.0,"16/11 12-45",21.3,64
1384602420.0,"16/11 12-47",21.3,64
1384602540.0,"16/11 12-49",21.3,64
1384602660.0,"16/11 12-51",21.3,64
1384602780.0,"16/11 12-53",21.4,64
1384602900.0,"16/11 12-55",21.4,65
1384603020.0,"16/11 12-57",21.4,65
1384603140.0,"16/11 12-59",21.4,65
1384603260.0,"16/11 13-01",21.4,65
1384603380.0,"16/11 13-03",21.5,65
1384603500.0,"16/11 13-05",21.5,65
1384603620.0,"16/11 13-07",21.5,65
1384603740.0,"16/11 13-09",21.5,65
1384603860.0,"16/11 13-11",21.5,65
1384603980.0,"16/11 13-13",21.5,66
1384604100.0,"16/11 13-15",21.5,66
1384604220.0,"16/11 13-17",21.5,66
1384604340.0,"16/11 13-19",21.5,66
1384604460.0,"16/11 13-21",21.5,66
1384604580.0,"16/11 13-23",21.5,66
1384604700.0,"16/11 13-25",21.5,66
1384604820.0,"16/11 13-27",21.5,66
1384604940.0,"16/11 13-29",21.5,67
1384605060.0,"16/11 13-31",21.5,67
1384605180.0,"16/11 13-33",21.5,67
1384605300.0,"16/11 13-35",21.5,67
1384605420.0,"16/11 13-37",21.5,67
1384605540.0,"16/11 13-39",21.5,67
1384605660.0,"16/11 13-41",21.5,67
1384605780.0,"16/11 13-43",21.5,67
1384605900.0,"16/11 13-45",21.6,67
1384606020.0,"16/11 13-47",21.6,67
1384606140.0,"16/11 13-49",21.6,67
1384606260.0,"16/11 13-51",21.6,68
1384606380.0,"16/11 13-53",21.6,68
1384606500.0,"16/11 13-55",21.6,68
1384606620.0,"16/11 13-57",21.6,68
1384606740.0,"16/11 13-59",21.7,68
1384606860.0,"16/11 14-01",21.7,68
1384606980.0,"16/11 14-03",21.7,68
1384607100.0,"16/11 14-05",21.7,68
1384607220.0,"16/11 14-07",21.7,68
1384607340.0,"16/11 14-09",21.7,68
1384607460.0,"16/11 14-11",21.7,68
1384607580.0,"16/11 14-13",21.7,68
1384607700.0,"16/11 14-15",21.7,68
1384607820.0,"16/11 14-17",21.7,68
1384607940.0,"16/11 14-19",21.7,68
1384608060.0,"16/11 14-21",21.7,68
1384608180.0,"16/11 14-23",21.7,68
1384608300.0,"16/11 14-25",21.7,68
1384608420.0,"16/11 14-27",21.7,68
1384608540.0,"16/11 14-29",21.7,68
1384608660.0,"16/11 14-31",21.7,68
1384608780.0,"16/11 14-33",21.7,68
1384608900.0,"16/11 14-35",21.7,68
1384609020.0,"16/11 14-37",21.7,68
1384609140.0,"16/11 14-39",21.7,68
1384609260.0,"16/11 14-41",21.7,68
1384609380.0,"16/11 14-43",21.7,68
1384609500.0,"16/11 14-45",21.7,68
1384609620.0,"16/11 14-47",21.7,68
1384609740.0,"16/11 14-49",21.7,68
1384609860.0,"16/11 14-51",21.7,68
1384609980.0,"16/11 14-53",21.7,68
1384610100.0,"16/11 14-55",21.7,68
1384610220.0,"16/11 14-57",21.7,68
1384610340.0,"16/11 14-59",21.7,68
1384610460.0,"16/11 15-01",21.7,68
1384610580.0,"16/11 15-03",21.7,68
1384610700.0,"16/11 15-05",21.7,68
1384610820.0,"16/11 15-07",21.7,68
1384610940.0,"16/11 15-09",21.7,68
1384611060.0,"16/11 15-11",21.7,68
1384611180.0,"16/11 15-13",21.7,68
1384611300.0,"16/11 15-15",21.7,68
1384611420.0,"16/11 15-17",21.7,68
1384611540.0,"16/11 15-19",21.7,68
1384611660.0,"16/11 15-21",21.7,68
1384611780.0,"16/11 15-23",21.7,68
1384611900.0,"16/11 15-25",21.7,68
1384612020.0,"16/11 15-27",21.7,69
1384612140.0,"16/11 15-29",21.8,69
1384612260.0,"16/11 15-31",21.8,69
1384612380.0,"16/11 15-33",21.8,69
1384612500.0,"16/11 15-35",21.8,69
1384612620.0,"16/11 15-37",21.8,69
1384612740.0,"16/11 15-39",21.8,69
1384612860.0,"16/11 15-41",21.8,69
1384612980.0,"16/11 15-43",21.8,69
1384613100.0,"16/11 15-45",21.8,69
1384613220.0,"16/11 15-47",21.8,69
1384613340.0,"16/11 15-49",21.8,69
1384613460.0,"16/11 15-51",21.8,69
1384613580.0,"16/11 15-53",21.8,69
1384613700.0,"16/11 15-55",21.8,70
1384613820.0,"16/11 15-57",21.8,70
1384613940.0,"16/11 15-59",21.8,70
1384614060.0,"16/11 16-01",21.8,69
1384614180.0,"16/11 16-03",21.8,69
1384614300.0,"16/11 16-05",21.8,70
1384614420.0,"16/11 16-07",21.8,70
1384614540.0,"16/11 16-09",21.8,70
1384614660.0,"16/11 16-11",21.8,70
1384614780.0,"16/11 16-13",21.8,70
1384614900.0,"16/11 16-15",21.8,70
1384615020.0,"16/11 16-17",21.8,70
1384615140.0,"16/11 16-19",21.8,70
1384615260.0,"16/11 16-21",21.9,70
1384615380.0,"16/11 16-23",21.9,70
1384615500.0,"16/11 16-25",21.9,70
1384615620.0,"16/11 16-27",21.9,70
1384615740.0,"16/11 16-29",21.9,70
1384615860.0,"16/11 16-31",21.9,70
1384615980.0,"16/11 16-33",21.9,70
1384616100.0,"16/11 16-35",21.9,70
1384616220.0,"16/11 16-37",21.9,70
1384616340.0,"16/11 16-39",21.9,70
1384616460.0,"16/11 16-41",21.9,70
1384616580.0,"16/11 16-43",21.8,70
1384616700.0,"16/11 16-45",21.8,70
1384616820.0,"16/11 16-47",21.8,70
1384616940.0,"16/11 16-49",21.8,70
1384617060.0,"16/11 16-51",21.8,70
1384617180.0,"16/11 16-53",21.8,70
1384617300.0,"16/11 16-55",21.8,70
1384617420.0,"16/11 16-57",21.8,70
1384617540.0,"16/11 16-59",21.8,70
1384617660.0,"16/11 17-01",21.8,70
1384617780.0,"16/11 17-03",21.8,70
1384617900.0,"16/11 17-05",21.8,70
1384618020.0,"16/11 17-07",21.8,70
1384618140.0,"16/11 17-09",21.8,70
1384618260.0,"16/11 17-11",21.8,69
1384618380.0,"16/11 17-13",21.8,69
1384618500.0,"16/11 17-15",21.8,69
1384618620.0,"16/11 17-17",21.8,69
1384618740.0,"16/11 17-19",21.8,69
1384618860.0,"16/11 17-21",21.8,69
1384618980.0,"16/11 17-23",21.8,69
1384619100.0,"16/11 17-25",21.7,69
1384619220.0,"16/11 17-27",21.7,69
1384619340.0,"16/11 17-29",21.7,69
1384619460.0,"16/11 17-31",21.7,69
1384619580.0,"16/11 17-33",21.7,69
1384619700.0,"16/11 17-35",21.6,68
1384619820.0,"16/11 17-37",21.6,68
1384619940.0,"16/11 17-39",21.6,68
1384620060.0,"16/11 17-41",21.6,68
1384620180.0,"16/11 17-43",21.5,67
1384620300.0,"16/11 17-45",21.5,67
1384620420.0,"16/11 17-47",21.5,67
1384620540.0,"16/11 17-49",21.5,67
1384620660.0,"16/11 17-51",21.4,67
1384620780.0,"16/11 17-53",21.4,67
1384620900.0,"16/11 17-55",21.4,67
1384621020.0,"16/11 17-57",21.4,67
1384621140.0,"16/11 17-59",21.4,67
1384621260.0,"16/11 18-01",21.4,67
1384621380.0,"16/11 18-03",21.4,67
1384621500.0,"16/11 18-05",21.3,67
1384621620.0,"16/11 18-07",21.3,67
1384621740.0,"16/11 18-09",21.3,67
1384621860.0,"16/11 18-11",21.3,66
1384621980.0,"16/11 18-13",21.3,66
1384622100.0,"16/11 18-15",21.3,66
1384622220.0,"16/11 18-17",21.2,66
1384622340.0,"16/11 18-19",21.2,66
1384622460.0,"16/11 18-21",21.2,66
1384622580.0,"16/11 18-23",21.2,66
1384622700.0,"16/11 18-25",21.2,66
1384622820.0,"16/11 18-27",21.2,66
1384622940.0,"16/11 18-29",21.2,66
1384623060.0,"16/11 18-31",21.3,66
1384623180.0,"16/11 18-33",21.3,67
1384623300.0,"16/11 18-35",21.3,67
1384623420.0,"16/11 18-37",21.3,67
1384623540.0,"16/11 18-39",21.3,67
1384623660.0,"16/11 18-41",21.3,67
1384623780.0,"16/11 18-43",21.3,67
1384623900.0,"16/11 18-45",21.3,67
1384624020.0,"16/11 18-47",21.3,67
1384624140.0,"16/11 18-49",21.9,68
1384624260.0,"16/11 18-51",22.1,65
