{
  "_class": "group",
  "do_objectID": "88DA7735-02BA-4B2F-A465-1A125FA07C16",
  "exportOptions": {
    "_class": "exportOptions",
    "exportFormats": [
    ],
    "includedLayerIds": [
    ],
    "layerOptions": 0,
    "shouldTrim": false
  },
  "frame": {
    "_class": "rect",
    "constrainProportions": false,
    "height": 40,
    "width": 220,
    "x": 0,
    "y": 0
  },
  "hasClickThrough": false,
  "isFlippedHorizontal": false,
  "isFlippedVertical": false,
  "isLocked": false,
  "isVisible": true,
  "layerListExpandedType": 0,
  "layers": [
    {
      "class": "shapeGroup",
      "id": "74D7F20E-F238-4E8C-A91E-AB4AFEFFFAB1"
    },
    {
      "class": "text",
      "id": "8357D25A-1F0E-4D2C-AD0E-6E60F2819D1B"
    },
    {
      "class": "group",
      "id": "CF797ACD-7AD2-4084-BDD9-BD431EAD12EF"
    }
  ],
  "name": "💡tab",
  "nameIsFixed": false,
  "resizingConstraint": 63,
  "resizingType": 0,
  "rotation": 0,
  "shouldBreakMaskChain": false,
  "style": {
    "_class": "style",
    "endDecorationType": 0,
    "miterLimit": 10,
    "startDecorationType": 0
  }
}