{
  "_class": "group",
  "do_objectID": "EC437D01-2530-4DFA-9220-0753A300BA4C",
  "exportOptions": {
    "_class": "exportOptions",
    "exportFormats": [
    ],
    "includedLayerIds": [
    ],
    "layerOptions": 0,
    "shouldTrim": false
  },
  "frame": {
    "_class": "rect",
    "constrainProportions": false,
    "height": 2059,
    "width": 1459,
    "x": 343,
    "y": 144
  },
  "hasClickThrough": false,
  "isFlippedHorizontal": false,
  "isFlippedVertical": false,
  "isLocked": false,
  "isVisible": true,
  "layerListExpandedType": 0,
  "layers": [
    {
      "class": "group",
      "id": "D51AFBD6-372F-4672-81CD-FFC6ECE48283"
    },
    {
      "class": "symbolInstance",
      "id": "3243C32A-1F91-4C65-954B-876FC3D18877"
    },
    {
      "class": "symbolInstance",
      "id": "977F8FA2-4413-4B5C-B424-97DEFE590AD9"
    },
    {
      "class": "symbolInstance",
      "id": "4E0A99A4-0F0C-4EB6-B703-CEA8F695D6A4"
    },
    {
      "class": "symbolInstance",
      "id": "65144287-B940-4B33-BF1C-0D99E13AAFEC"
    },
    {
      "class": "symbolInstance",
      "id": "47DA21AC-A177-40EE-86C5-22F5ED072403"
    },
    {
      "class": "symbolInstance",
      "id": "A37C18A4-70AF-4699-AD4B-BA1341E62230"
    },
    {
      "class": "symbolInstance",
      "id": "7AF53F1B-0E94-4602-A110-6EDD6EF4B485"
    },
    {
      "class": "symbolInstance",
      "id": "292D1BC2-152D-4131-B23B-0A16902FFFB2"
    },
    {
      "class": "symbolInstance",
      "id": "B809480E-EF6F-4BE9-BC9D-E018E41ED7E1"
    },
    {
      "class": "symbolInstance",
      "id": "FA96CEA3-8C52-4385-814F-A097D572D469"
    },
    {
      "class": "symbolInstance",
      "id": "CDF0A0E0-12A2-430F-8483-949C4EA0CF6F"
    },
    {
      "class": "symbolInstance",
      "id": "31BA9E52-3C6E-4AF5-9059-D0CCDB3E968A"
    },
    {
      "class": "symbolInstance",
      "id": "D16B1FD2-9477-4039-A295-24C806F5C6BA"
    },
    {
      "class": "symbolInstance",
      "id": "5B63FCE6-1620-4210-B13E-881B6C9A253B"
    },
    {
      "class": "symbolInstance",
      "id": "BD5C0C19-C4F6-49C9-86DF-654774870427"
    },
    {
      "class": "symbolInstance",
      "id": "F5F7D0A2-E37D-44C9-9E25-B8D051DF3FC0"
    },
    {
      "class": "symbolInstance",
      "id": "A99A2945-E195-47F4-8CF0-4E4CAE449EF7"
    },
    {
      "class": "symbolInstance",
      "id": "3732EF50-48C7-4B76-87BB-D95A4338C2BA"
    },
    {
      "class": "symbolInstance",
      "id": "43878F94-4795-4513-9A78-DA66E6BB064B"
    },
    {
      "class": "symbolInstance",
      "id": "298D1FF8-8813-4571-BD30-1D4991705AB3"
    },
    {
      "class": "symbolInstance",
      "id": "D2CF3918-759A-4775-A045-9A28539152FE"
    },
    {
      "class": "symbolInstance",
      "id": "046B1093-7793-43E1-BD01-C60D1A5A3E4F"
    },
    {
      "class": "symbolInstance",
      "id": "DC7C1989-A124-47C7-8D89-307CDDB6EE74"
    },
    {
      "class": "symbolInstance",
      "id": "28E03251-F05C-4D6C-BA57-17967B8C5A93"
    },
    {
      "class": "symbolInstance",
      "id": "D501004D-6942-440A-8EA5-5579929F202B"
    },
    {
      "class": "symbolInstance",
      "id": "8E96BDF1-91D6-4E4A-8F21-EB5BA9B92F87"
    },
    {
      "class": "symbolInstance",
      "id": "E232D8FD-5476-405B-8CF2-3A1164D4CC44"
    },
    {
      "class": "symbolInstance",
      "id": "FD2E675E-155F-4F1B-80B5-DEF9EEF70B3B"
    },
    {
      "class": "symbolInstance",
      "id": "7B906124-F81B-48B8-B2A6-9559B60371C5"
    },
    {
      "class": "symbolInstance",
      "id": "B5E16667-0113-4B1B-BD10-1339403231D5"
    },
    {
      "class": "symbolInstance",
      "id": "0CD76D3B-9BD1-4912-80E6-CCA5172B0294"
    },
    {
      "class": "symbolInstance",
      "id": "54E95BDD-6F5B-4AD8-9635-6509ABF08418"
    },
    {
      "class": "symbolInstance",
      "id": "E37C8AD0-7399-4D1B-80BB-22212986AB4D"
    },
    {
      "class": "symbolInstance",
      "id": "0EC23671-6B5F-4F82-B90D-5F885C785B49"
    },
    {
      "class": "symbolInstance",
      "id": "BC61CDEC-8D9A-4797-8ED3-3F4F71F45024"
    },
    {
      "class": "symbolInstance",
      "id": "87A0B58D-7306-4EA6-8E4E-7FC677E8B05C"
    },
    {
      "class": "symbolInstance",
      "id": "9E0D076B-3D50-456E-810D-7C2628FDACF4"
    },
    {
      "class": "symbolInstance",
      "id": "95BC2F44-C084-428A-988C-4C964FF34EFB"
    },
    {
      "class": "symbolInstance",
      "id": "59CB13B5-B632-498D-9A7C-87A14E9979F3"
    },
    {
      "class": "symbolInstance",
      "id": "761FF2F9-F138-437C-8B78-8FF681F4C21A"
    },
    {
      "class": "symbolInstance",
      "id": "97C0F786-9D1B-4829-AC00-5ACC237D305A"
    },
    {
      "class": "symbolInstance",
      "id": "89884311-3DE1-42DC-A5C5-3DF297759E6D"
    },
    {
      "class": "symbolInstance",
      "id": "EDBDB87C-6681-49BB-A2EE-A67D87CFBE71"
    },
    {
      "class": "symbolInstance",
      "id": "C0C996D6-8049-4E3A-94DE-92A275F9E7C4"
    },
    {
      "class": "symbolInstance",
      "id": "51756DA4-9A86-4864-9A28-319AE40B3D8A"
    },
    {
      "class": "symbolInstance",
      "id": "46FEC2A1-FD1E-4DE5-834C-0966D7318BFA"
    },
    {
      "class": "symbolInstance",
      "id": "280D8ECB-80AE-4CAD-9DFA-B58B814DB8F9"
    },
    {
      "class": "symbolInstance",
      "id": "23E4B69F-6017-4DD5-8CAA-20FDB152A366"
    },
    {
      "class": "symbolInstance",
      "id": "60FE1C6D-769A-4BAC-8FD2-B668882D93BA"
    },
    {
      "class": "symbolInstance",
      "id": "DB61BB59-F3FE-4B41-A2F1-4BE6170D82B2"
    },
    {
      "class": "symbolInstance",
      "id": "029EB310-BB0F-4D52-B376-EE40AF4347F1"
    },
    {
      "class": "symbolInstance",
      "id": "52342E55-F8C1-45BF-BF74-D5A097944F27"
    },
    {
      "class": "symbolInstance",
      "id": "5B14534E-12A7-48B0-899F-F4ADC683FF10"
    },
    {
      "class": "symbolInstance",
      "id": "5BBD2AC1-9404-433A-B873-D3F3990A51F8"
    }
  ],
  "name": "weekenddays",
  "nameIsFixed": true,
  "resizingConstraint": 63,
  "resizingType": 0,
  "rotation": 0,
  "shouldBreakMaskChain": false,
  "style": {
    "_class": "style",
    "endDecorationType": 0,
    "miterLimit": 10,
    "startDecorationType": 0
  }
}