{
  "_class": "shapeGroup",
  "clippingMaskMode": 0,
  "do_objectID": "01F41ABE-7613-4E55-89DF-85CDE34B3A44",
  "exportOptions": {
    "_class": "exportOptions",
    "exportFormats": [
    ],
    "includedLayerIds": [
    ],
    "layerOptions": 0,
    "shouldTrim": false
  },
  "frame": {
    "_class": "rect",
    "constrainProportions": true,
    "height": 15.75912887893758,
    "width": 16,
    "x": 0,
    "y": 0
  },
  "hasClickThrough": false,
  "hasClippingMask": true,
  "isFlippedHorizontal": false,
  "isFlippedVertical": false,
  "isLocked": false,
  "isVisible": true,
  "layerListExpandedType": 1,
  "layers": [
    {
      "class": "shapePath",
      "id": "1AD928FD-2123-4C44-B386-F2E99B57B73F"
    },
    {
      "class": "shapePath",
      "id": "B3C78837-68B8-4B8A-BD58-FE9D26225133"
    },
    {
      "class": "shapePath",
      "id": "6A3D90D8-83C5-4564-95E5-9200B1775839"
    },
    {
      "class": "shapePath",
      "id": "36485DDD-8552-4DCE-B75B-51F23116B67B"
    },
    {
      "class": "shapePath",
      "id": "7F4AC164-D0F3-49BC-9EF4-E06F491C862D"
    }
  ],
  "name": "Shape",
  "nameIsFixed": false,
  "resizingConstraint": 63,
  "resizingType": 0,
  "rotation": 0,
  "shouldBreakMaskChain": false,
  "style": {
    "_class": "style",
    "endDecorationType": 0,
    "fills": [
      {
        "_class": "fill",
        "color": {
          "_class": "color",
          "alpha": 1,
          "blue": 0,
          "green": 0,
          "red": 0
        },
        "fillType": 0,
        "isEnabled": true,
        "noiseIndex": 0,
        "noiseIntensity": 0,
        "patternFillType": 1,
        "patternTileScale": 1
      }
    ],
    "miterLimit": 10,
    "startDecorationType": 0
  },
  "windingRule": 0
}