{
  "_class": "shapePath",
  "booleanOperation": -1,
  "do_objectID": "DD7617E0-EA00-453D-9635-483767BABD8D",
  "edited": true,
  "exportOptions": {
    "_class": "exportOptions",
    "exportFormats": [
    ],
    "includedLayerIds": [
    ],
    "layerOptions": 0,
    "shouldTrim": false
  },
  "frame": {
    "_class": "rect",
    "constrainProportions": false,
    "height": 8,
    "width": 12,
    "x": 2,
    "y": 5.999918147759528
  },
  "isFlippedHorizontal": false,
  "isFlippedVertical": false,
  "isLocked": false,
  "isVisible": true,
  "layerListExpandedType": 0,
  "name": "Path",
  "nameIsFixed": false,
  "path": {
    "_class": "path",
    "isClosed": true,
    "pointRadiusBehaviour": 1,
    "points": [
      {
        "_class": "curvePoint",
        "cornerRadius": 0,
        "curveFrom": "{0, 0.0625}",
        "curveMode": 4,
        "curveTo": "{0, 0.027982203135575423}",
        "hasCurveFrom": false,
        "hasCurveTo": true,
        "point": "{0, 0.0625}"
      },
      {
        "_class": "curvePoint",
        "cornerRadius": 0,
        "curveFrom": "{0, 0.94403559372884893}",
        "curveMode": 4,
        "curveTo": "{0, 0.875}",
        "hasCurveFrom": true,
        "hasCurveTo": false,
        "point": "{0, 0.875}"
      },
      {
        "_class": "curvePoint",
        "cornerRadius": 0,
        "curveFrom": "{0.083333333333333329, 1}",
        "curveMode": 4,
        "curveTo": "{0.037309604180767342, 1}",
        "hasCurveFrom": false,
        "hasCurveTo": true,
        "point": "{0.083333333333333329, 1}"
      },
      {
        "_class": "curvePoint",
        "cornerRadius": 0,
        "curveFrom": "{0.96269039581923244, 1}",
        "curveMode": 4,
        "curveTo": "{0.91666666666666663, 1}",
        "hasCurveFrom": true,
        "hasCurveTo": false,
        "point": "{0.91666666666666663, 1}"
      },
      {
        "_class": "curvePoint",
        "cornerRadius": 0,
        "curveFrom": "{1, 0.875}",
        "curveMode": 4,
        "curveTo": "{1, 0.94403559372884871}",
        "hasCurveFrom": false,
        "hasCurveTo": true,
        "point": "{1, 0.875}"
      },
      {
        "_class": "curvePoint",
        "cornerRadius": 0,
        "curveFrom": "{1, 0.027982203135575423}",
        "curveMode": 4,
        "curveTo": "{1, 0.0625}",
        "hasCurveFrom": true,
        "hasCurveTo": false,
        "point": "{1, 0.0625}"
      },
      {
        "_class": "curvePoint",
        "cornerRadius": 0,
        "curveFrom": "{0.95833333333333337, 0}",
        "curveMode": 4,
        "curveTo": "{0.98134519790961638, 0}",
        "hasCurveFrom": false,
        "hasCurveTo": true,
        "point": "{0.95833333333333337, 0}"
      },
      {
        "_class": "curvePoint",
        "cornerRadius": 0,
        "curveFrom": "{0.018654802090383615, 0}",
        "curveMode": 4,
        "curveTo": "{0.041666666666666664, 0}",
        "hasCurveFrom": true,
        "hasCurveTo": false,
        "point": "{0.041666666666666664, 0}"
      }
    ]
  },
  "resizingConstraint": 63,
  "resizingType": 0,
  "rotation": 0,
  "shouldBreakMaskChain": false
}