{
  "_class": "symbolInstance",
  "do_objectID": "2F1E7868-1868-4C5A-BAFB-63B52427864F",
  "exportOptions": {
    "_class": "exportOptions",
    "exportFormats": [
    ],
    "includedLayerIds": [
    ],
    "layerOptions": 0,
    "shouldTrim": false
  },
  "frame": {
    "_class": "rect",
    "constrainProportions": false,
    "height": 32,
    "width": 47,
    "x": 418,
    "y": 0
  },
  "horizontalSpacing": 0,
  "isFlippedHorizontal": false,
  "isFlippedVertical": false,
  "isLocked": false,
  "isVisible": true,
  "layerListExpandedType": 0,
  "masterInfluenceEdgeMaxXPadding": 65,
  "masterInfluenceEdgeMaxYPadding": 520,
  "masterInfluenceEdgeMinXPadding": 674,
  "masterInfluenceEdgeMinYPadding": 256,
  "name": "topbar/molecules/badge",
  "nameIsFixed": true,
  "overrides": {
    "39A06CA2-25FE-4779-AFCE-444708E7914D": {
      "symbolID": "6A60A62C-C6F3-41DB-8012-84F697CAC341"
    },
    "DCC27D08-1795-4A83-8654-E1B9EEF67636": {
      "A5DA60E8-BF10-4216-B002-7255CA8C30DD": {
        "symbolID": "62E4F516-741E-4DF0-B87C-D7003C843EE8"
      },
      "E4B3B66A-8773-408F-9D46-4CA7C03FD1AC": {
        "symbolID": "C1C1376D-B7A5-4609-BAC1-456A1E128CA6"
      },
      "symbolID": "AA748C4A-3D65-4124-BA15-BE8EED5557E0"
    },
    "F8918A14-C3A6-41AD-B604-5B0D5E4A267E": {
      "470201D2-B606-42CA-A42F-75C176B63510": {
        "symbolID": "B317526B-A873-4024-958F-38CA946FD846"
      },
      "symbolID": "8FBFBCA9-F712-4BB2-A865-4F77AE42B743"
    }
  },
  "resizingConstraint": 63,
  "resizingType": 0,
  "rotation": 0,
  "shouldBreakMaskChain": false,
  "style": {
    "_class": "style",
    "endDecorationType": 0,
    "miterLimit": 10,
    "startDecorationType": 0
  },
  "symbolID": "320BC548-BB25-40F7-B16A-7018EA46B9E9",
  "verticalSpacing": 0
}