{
  "_class": "group",
  "do_objectID": "75E19290-FCE0-47BD-9D51-4B76CFEF13CE",
  "exportOptions": {
    "_class": "exportOptions",
    "exportFormats": [
    ],
    "includedLayerIds": [
    ],
    "layerOptions": 0,
    "shouldTrim": false
  },
  "frame": {
    "_class": "rect",
    "constrainProportions": false,
    "height": 28,
    "width": 527,
    "x": 235,
    "y": 30
  },
  "hasClickThrough": false,
  "isFlippedHorizontal": false,
  "isFlippedVertical": false,
  "isLocked": false,
  "isVisible": true,
  "layerListExpandedType": 2,
  "layers": [
    {
      "class": "shapeGroup",
      "id": "CAE471C0-A7FD-4334-BE78-F864DC5B3013"
    },
    {
      "class": "shapeGroup",
      "id": "0540554A-0837-4E91-8475-7FC2944088A6"
    },
    {
      "class": "shapeGroup",
      "id": "C1BE3041-FD52-44E8-A82B-28B15B80F556"
    },
    {
      "class": "shapeGroup",
      "id": "5F3E6928-78F3-479D-9328-36A3B38E0889"
    },
    {
      "class": "shapeGroup",
      "id": "F010193E-E0D6-4643-A6AE-571B128D5A1A"
    }
  ],
  "name": "new_epic copy 19",
  "nameIsFixed": true,
  "resizingConstraint": 63,
  "resizingType": 0,
  "rotation": 0,
  "shouldBreakMaskChain": false,
  "style": {
    "_class": "style",
    "endDecorationType": 0,
    "miterLimit": 10,
    "startDecorationType": 0
  }
}