{
  "_class": "shapePath",
  "booleanOperation": -1,
  "do_objectID": "1A2BF672-E3E9-4092-8C98-D161FE879C31",
  "edited": true,
  "exportOptions": {
    "_class": "exportOptions",
    "exportFormats": [
    ],
    "includedLayerIds": [
    ],
    "layerOptions": 0,
    "shouldTrim": false
  },
  "frame": {
    "_class": "rect",
    "constrainProportions": false,
    "height": 8.203772410170409,
    "width": 11.25974421962314,
    "x": 4.740255780376877,
    "y": 0.259972164770601
  },
  "isFlippedHorizontal": false,
  "isFlippedVertical": false,
  "isLocked": false,
  "isVisible": true,
  "layerListExpandedType": 0,
  "name": "Path",
  "nameIsFixed": false,
  "path": {
    "_class": "path",
    "isClosed": true,
    "pointRadiusBehaviour": 1,
    "points": [
      {
        "_class": "curvePoint",
        "cornerRadius": 0,
        "curveFrom": "{0.36512392830509066, 0.68469903125906595}",
        "curveMode": 1,
        "curveTo": "{0.36512392830509066, 0.68469903125906595}",
        "hasCurveFrom": false,
        "hasCurveTo": false,
        "point": "{0.36512392830509066, 0.68469903125906595}"
      },
      {
        "_class": "curvePoint",
        "cornerRadius": 0,
        "curveFrom": "{0.8744351779943641, -0.012750807284112797}",
        "curveMode": 4,
        "curveTo": "{0.83719017923727268, 0.038252421852338396}",
        "hasCurveFrom": true,
        "hasCurveTo": false,
        "point": "{0.83719017923727268, 0.038252421852338396}"
      },
      {
        "_class": "curvePoint",
        "cornerRadius": 0,
        "curveFrom": "{1.0093112496892731, 0.089255650988789584}",
        "curveMode": 2,
        "curveTo": "{0.93482125217508993, -0.012750807284112797}",
        "hasCurveFrom": true,
        "hasCurveTo": true,
        "point": "{0.97206625093218157, 0.038252421852338396}"
      },
      {
        "_class": "curvePoint",
        "cornerRadius": 0,
        "curveFrom": "{0.97206625093218157, 0.22295145311140302}",
        "curveMode": 4,
        "curveTo": "{1.0093112496892731, 0.17194822397495177}",
        "hasCurveFrom": false,
        "hasCurveTo": true,
        "point": "{0.97206625093218157, 0.22295145311140302}"
      },
      {
        "_class": "curvePoint",
        "cornerRadius": 0,
        "curveFrom": "{0.41393946477400095, 0.98724919271588674}",
        "curveMode": 4,
        "curveTo": "{0.43256196415254633, 0.96174757814766143}",
        "hasCurveFrom": true,
        "hasCurveTo": false,
        "point": "{0.43256196415254633, 0.96174757814766143}"
      },
      {
        "_class": "curvePoint",
        "cornerRadius": 0,
        "curveFrom": "{0.34071616007063688, 1.0000000000000016}",
        "curveMode": 2,
        "curveTo": "{0.38953169653954683, 0.99999999999999956}",
        "hasCurveFrom": true,
        "hasCurveTo": true,
        "point": "{0.36512392830509305, 1}"
      },
      {
        "_class": "curvePoint",
        "cornerRadius": 0,
        "curveFrom": "{0.29768589245763627, 0.9617475781476631}",
        "curveMode": 4,
        "curveTo": "{0.31630839183618226, 0.98724919271588907}",
        "hasCurveFrom": false,
        "hasCurveTo": true,
        "point": "{0.29768589245763627, 0.9617475781476631}"
      },
      {
        "_class": "curvePoint",
        "cornerRadius": 0,
        "curveFrom": "{-0.0093112496892728477, 0.5413462864930827}",
        "curveMode": 4,
        "curveTo": "{0.02793374906781863, 0.59234951562953386}",
        "hasCurveFrom": true,
        "hasCurveTo": false,
        "point": "{0.02793374906781863, 0.59234951562953386}"
      },
      {
        "_class": "curvePoint",
        "cornerRadius": 0,
        "curveFrom": "{0.065178747824910024, 0.35664725523401808}",
        "curveMode": 2,
        "curveTo": "{-0.0093112496892728477, 0.45865371350692047}",
        "hasCurveFrom": true,
        "hasCurveTo": true,
        "point": "{0.027933749067818547, 0.4076504843704693}"
      },
      {
        "_class": "curvePoint",
        "cornerRadius": 0,
        "curveFrom": "{0.16280982076272746, 0.4076504843704693}",
        "curveMode": 4,
        "curveTo": "{0.12556482200563598, 0.35664725523401808}",
        "hasCurveFrom": false,
        "hasCurveTo": true,
        "point": "{0.16280982076272746, 0.4076504843704693}"
      },
      {
        "_class": "curvePoint",
        "cornerRadius": 0,
        "curveFrom": "{0.36512392830509066, 0.68469903125906617}",
        "curveMode": 1,
        "curveTo": "{0.36512392830509066, 0.68469903125906617}",
        "hasCurveFrom": false,
        "hasCurveTo": false,
        "point": "{0.36512392830509066, 0.68469903125906617}"
      }
    ]
  },
  "resizingConstraint": 63,
  "resizingType": 0,
  "rotation": 0,
  "shouldBreakMaskChain": false
}