{
  "_class": "shapePath",
  "booleanOperation": -1,
  "do_objectID": "9DBF36CD-14ED-4152-BEDC-3FEAE97FC792",
  "edited": true,
  "exportOptions": {
    "_class": "exportOptions",
    "exportFormats": [
    ],
    "includedLayerIds": [
    ],
    "layerOptions": 0,
    "shouldTrim": false
  },
  "frame": {
    "_class": "rect",
    "constrainProportions": false,
    "height": 6.179398065659443,
    "width": 6.03370193803068,
    "x": 4.983149030984661,
    "y": 5.149498388049537
  },
  "isFlippedHorizontal": false,
  "isFlippedVertical": false,
  "isLocked": false,
  "isVisible": true,
  "layerListExpandedType": 0,
  "name": "Path",
  "nameIsFixed": false,
  "path": {
    "_class": "path",
    "isClosed": true,
    "pointRadiusBehaviour": 1,
    "points": [
      {
        "_class": "curvePoint",
        "cornerRadius": 0,
        "curveFrom": "{0.77614237490000004, 1}",
        "curveMode": 2,
        "curveTo": "{0.22385762509999993, 1}",
        "hasCurveFrom": true,
        "hasCurveTo": true,
        "point": "{0.50000000000000011, 1}"
      },
      {
        "_class": "curvePoint",
        "cornerRadius": 0,
        "curveFrom": "{1, 0.22385762510000001}",
        "curveMode": 2,
        "curveTo": "{1, 0.77614237489999993}",
        "hasCurveFrom": true,
        "hasCurveTo": true,
        "point": "{1, 0.5}"
      },
      {
        "_class": "curvePoint",
        "cornerRadius": 0,
        "curveFrom": "{0.22385762509999993, 0}",
        "curveMode": 2,
        "curveTo": "{0.77614237490000004, 0}",
        "hasCurveFrom": true,
        "hasCurveTo": true,
        "point": "{0.50000000000000011, 0}"
      },
      {
        "_class": "curvePoint",
        "cornerRadius": 0,
        "curveFrom": "{0, 0.77614237489999993}",
        "curveMode": 2,
        "curveTo": "{0, 0.22385762510000001}",
        "hasCurveFrom": true,
        "hasCurveTo": true,
        "point": "{0, 0.5}"
      }
    ]
  },
  "resizingConstraint": 63,
  "resizingType": 0,
  "rotation": 0,
  "shouldBreakMaskChain": false
}