<?xml version="1.0" encoding="UTF-8" standalone="no"?>
<!-- Created with Inkscape (http://www.inkscape.org/) -->

<svg
   xmlns:dc="http://purl.org/dc/elements/1.1/"
   xmlns:cc="http://creativecommons.org/ns#"
   xmlns:rdf="http://www.w3.org/1999/02/22-rdf-syntax-ns#"
   xmlns:svg="http://www.w3.org/2000/svg"
   xmlns="http://www.w3.org/2000/svg"
   xmlns:sodipodi="http://sodipodi.sourceforge.net/DTD/sodipodi-0.dtd"
   xmlns:inkscape="http://www.inkscape.org/namespaces/inkscape"
   width="100mm"
   height="100mm"
   viewBox="0 0 100 100"
   version="1.1"
   id="svg8"
   inkscape:version="0.92.4 (5da689c313, 2019-01-14)"
   sodipodi:docname="plus-black.svg">
  <defs
     id="defs2">
    <clipPath
       clipPathUnits="userSpaceOnUse"
       id="clipPath336">
      <path
         d="M 0,136.058 H 263.619 V 0 H 0 Z"
         id="path334"
         inkscape:connector-curvature="0" />
    </clipPath>
  </defs>
  <sodipodi:namedview
     id="base"
     pagecolor="#ffffff"
     bordercolor="#666666"
     borderopacity="1.0"
     inkscape:pageopacity="0.0"
     inkscape:pageshadow="2"
     inkscape:zoom="0.98994949"
     inkscape:cx="256.38363"
     inkscape:cy="115.7208"
     inkscape:document-units="mm"
     inkscape:current-layer="text328"
     showgrid="false"
     inkscape:window-width="1920"
     inkscape:window-height="1080"
     inkscape:window-x="0"
     inkscape:window-y="0"
     inkscape:window-maximized="1"
     showguides="true"
     inkscape:guide-bbox="true">
    <sodipodi:guide
       position="68.153729,79.111779"
       orientation="0,1"
       id="guide1510"
       inkscape:locked="false" />
    <sodipodi:guide
       position="68.955538,21.381562"
       orientation="0,1"
       id="guide1512"
       inkscape:locked="false" />
    <sodipodi:guide
       position="27.261492,118.13313"
       orientation="1,0"
       id="guide1514"
       inkscape:locked="false" />
    <sodipodi:guide
       position="72.697311,123.21125"
       orientation="1,0"
       id="guide1516"
       inkscape:locked="false" />
  </sodipodi:namedview>
  <metadata
     id="metadata5">
    <rdf:RDF>
      <cc:Work
         rdf:about="">
        <dc:format>image/svg+xml</dc:format>
        <dc:type
           rdf:resource="http://purl.org/dc/dcmitype/StillImage" />
        <dc:title></dc:title>
      </cc:Work>
    </rdf:RDF>
  </metadata>
  <g
     inkscape:label="Layer 1"
     inkscape:groupmode="layer"
     id="layer1"
     transform="translate(0,-197)">
    <g
       aria-label="ll"
       style="font-variant:normal;font-weight:bold;font-stretch:normal;font-size:0.78867811px;font-family:'Myriad Pro';-inkscape-font-specification:MyriadPro-Bold;writing-mode:lr-tb;fill:#000000;fill-opacity:1;fill-rule:nonzero;stroke:none;stroke-width:0.03931478"
       id="text328"
       transform="matrix(96.233444,0,0,96.233444,-15344.432,-31421.103)">
      <path
         id="path858"
         style="fill:#000000;stroke-width:0.03931478"
         d="m 159.67006,329.14478 v -0.13786 h 0.59921 v 0.13786 z m 0.23067,-0.36853 h 0.13786 v 0.59921 h -0.13786 z" />
    </g>
  </g>
</svg>
