<?xml version="1.0" encoding="UTF-8" standalone="no"?>
<!-- Created with Inkscape (http://www.inkscape.org/) -->

<svg
   xmlns:dc="http://purl.org/dc/elements/1.1/"
   xmlns:cc="http://creativecommons.org/ns#"
   xmlns:rdf="http://www.w3.org/1999/02/22-rdf-syntax-ns#"
   xmlns:svg="http://www.w3.org/2000/svg"
   xmlns="http://www.w3.org/2000/svg"
   xmlns:sodipodi="http://sodipodi.sourceforge.net/DTD/sodipodi-0.dtd"
   xmlns:inkscape="http://www.inkscape.org/namespaces/inkscape"
   width="100mm"
   height="100mm"
   viewBox="0 0 100 100"
   version="1.1"
   id="svg8"
   inkscape:version="0.92.4 (5da689c313, 2019-01-14)"
   sodipodi:docname="play-white.svg">
  <defs
     id="defs2">
    <clipPath
       clipPathUnits="userSpaceOnUse"
       id="clipPath336">
      <path
         d="M 0,136.058 H 263.619 V 0 H 0 Z"
         id="path334"
         inkscape:connector-curvature="0" />
    </clipPath>
  </defs>
  <sodipodi:namedview
     id="base"
     pagecolor="#ffffff"
     bordercolor="#666666"
     borderopacity="1.0"
     inkscape:pageopacity="0.0"
     inkscape:pageshadow="2"
     inkscape:zoom="0.98994949"
     inkscape:cx="-46.165039"
     inkscape:cy="103.54089"
     inkscape:document-units="mm"
     inkscape:current-layer="g1508"
     showgrid="false"
     inkscape:window-width="1920"
     inkscape:window-height="1080"
     inkscape:window-x="0"
     inkscape:window-y="0"
     inkscape:window-maximized="1"
     showguides="true"
     inkscape:guide-bbox="true">
    <sodipodi:guide
       position="68.153729,79.111779"
       orientation="0,1"
       id="guide1510"
       inkscape:locked="false" />
    <sodipodi:guide
       position="68.955538,21.381562"
       orientation="0,1"
       id="guide1512"
       inkscape:locked="false" />
    <sodipodi:guide
       position="27.261492,118.13313"
       orientation="1,0"
       id="guide1514"
       inkscape:locked="false" />
    <sodipodi:guide
       position="72.697311,123.21125"
       orientation="1,0"
       id="guide1516"
       inkscape:locked="false" />
  </sodipodi:namedview>
  <metadata
     id="metadata5">
    <rdf:RDF>
      <cc:Work
         rdf:about="">
        <dc:format>image/svg+xml</dc:format>
        <dc:type
           rdf:resource="http://purl.org/dc/dcmitype/StillImage" />
        <dc:title></dc:title>
      </cc:Work>
    </rdf:RDF>
  </metadata>
  <g
     inkscape:label="Layer 1"
     inkscape:groupmode="layer"
     id="layer1"
     transform="translate(0,-197)">
    <g
       transform="matrix(0.35277777,0,0,-0.35277777,88.657321,292.12444)"
       id="g330">
      <g
         id="g332"
         clip-path="url(#clipPath336)">
        <g
           id="g338"
           transform="translate(207.9619,117.3496)">
          <path
             d="M 0,0 V -2.22 H 1.753 L 3.739,-4.086 V 2.103 L 1.869,0.059 Z"
             style="fill:#ffffff;fill-opacity:1;fill-rule:nonzero;stroke:none"
             id="path340"
             inkscape:connector-curvature="0" />
        </g>
        <g
           id="g342"
           transform="translate(177.1035,116.9819)">
          <path
             d="M 0,0 V -1.885 H 1.489 L 3.177,-3.471 V 1.787 L 1.587,0.05 Z"
             style="fill:#ffffff;fill-opacity:1;fill-rule:nonzero;stroke:none"
             id="path344"
             inkscape:connector-curvature="0" />
        </g>
        <g
           id="g346"
           transform="translate(180.9785,117.3735)">
          <path
             d="M 0,0 C 0,0 0.823,-0.811 0,-2.468"
             style="fill:none;stroke:#ffffff;stroke-width:0.391;stroke-linecap:round;stroke-linejoin:miter;stroke-miterlimit:10;stroke-dasharray:none;stroke-opacity:1"
             id="path348"
             inkscape:connector-curvature="0" />
        </g>
        <g
           id="g350"
           transform="translate(181.7783,118.105)">
          <path
             d="M 0,0 C 0,0 1.531,-1.577 0,-3.862"
             style="fill:none;stroke:#ffffff;stroke-width:0.391;stroke-linecap:round;stroke-linejoin:miter;stroke-miterlimit:10;stroke-dasharray:none;stroke-opacity:1"
             id="path352"
             inkscape:connector-curvature="0" />
        </g>
        <g
           id="g354"
           transform="translate(182.459,118.8599)">
          <path
             d="M 0,0 C 0,0 2.258,-2.263 0,-5.349"
             style="fill:none;stroke:#ffffff;stroke-width:0.391;stroke-linecap:round;stroke-linejoin:miter;stroke-miterlimit:10;stroke-dasharray:none;stroke-opacity:1"
             id="path356"
             inkscape:connector-curvature="0" />
        </g>
      </g>
    </g>
    <g
       id="g1508"
       transform="matrix(9.1378756,0,0,9.1378756,-1449.2592,-2798.3056)">
      <g
         transform="matrix(0.35277777,0,0,-0.35277777,161.60143,330.11157)"
         id="g126"
         style="fill:#ffffff">
        <path
           inkscape:connector-curvature="0"
           id="path128"
           style="fill:#ffffff;fill-opacity:1;fill-rule:nonzero;stroke:none"
           d="m 0,0 v -17.86 l 14,8.929 z" />
      </g>
    </g>
  </g>
</svg>
