<?xml version="1.0" encoding="UTF-8" standalone="no"?>
<!-- Created with Inkscape (http://www.inkscape.org/) -->

<svg
   xmlns:dc="http://purl.org/dc/elements/1.1/"
   xmlns:cc="http://creativecommons.org/ns#"
   xmlns:rdf="http://www.w3.org/1999/02/22-rdf-syntax-ns#"
   xmlns:svg="http://www.w3.org/2000/svg"
   xmlns="http://www.w3.org/2000/svg"
   xmlns:sodipodi="http://sodipodi.sourceforge.net/DTD/sodipodi-0.dtd"
   xmlns:inkscape="http://www.inkscape.org/namespaces/inkscape"
   width="100mm"
   height="100mm"
   viewBox="0 0 100 100"
   version="1.1"
   id="svg8"
   inkscape:version="0.92.4 (5da689c313, 2019-01-14)"
   sodipodi:docname="volume-max-black.svg">
  <defs
     id="defs2">
    <clipPath
       clipPathUnits="userSpaceOnUse"
       id="clipPath336">
      <path
         d="M 0,136.058 H 263.619 V 0 H 0 Z"
         id="path334"
         inkscape:connector-curvature="0" />
    </clipPath>
    <clipPath
       clipPathUnits="userSpaceOnUse"
       id="clipPath336-3">
      <path
         d="M 0,136.058 H 263.619 V 0 H 0 Z"
         id="path334-6"
         inkscape:connector-curvature="0" />
    </clipPath>
  </defs>
  <sodipodi:namedview
     id="base"
     pagecolor="#ffffff"
     bordercolor="#666666"
     borderopacity="1.0"
     inkscape:pageopacity="0.0"
     inkscape:pageshadow="2"
     inkscape:zoom="0.98994949"
     inkscape:cx="243.85535"
     inkscape:cy="15.802619"
     inkscape:document-units="mm"
     inkscape:current-layer="g1601"
     showgrid="false"
     inkscape:window-width="1920"
     inkscape:window-height="1080"
     inkscape:window-x="0"
     inkscape:window-y="0"
     inkscape:window-maximized="1"
     showguides="true"
     inkscape:guide-bbox="true">
    <sodipodi:guide
       position="68.153729,79.111779"
       orientation="0,1"
       id="guide1510"
       inkscape:locked="false" />
    <sodipodi:guide
       position="68.955538,21.381562"
       orientation="0,1"
       id="guide1512"
       inkscape:locked="false" />
    <sodipodi:guide
       position="27.261492,118.13313"
       orientation="1,0"
       id="guide1514"
       inkscape:locked="false" />
    <sodipodi:guide
       position="72.697311,123.21125"
       orientation="1,0"
       id="guide1516"
       inkscape:locked="false" />
  </sodipodi:namedview>
  <metadata
     id="metadata5">
    <rdf:RDF>
      <cc:Work
         rdf:about="">
        <dc:format>image/svg+xml</dc:format>
        <dc:type
           rdf:resource="http://purl.org/dc/dcmitype/StillImage" />
        <dc:title></dc:title>
      </cc:Work>
    </rdf:RDF>
  </metadata>
  <g
     inkscape:label="Layer 1"
     inkscape:groupmode="layer"
     id="layer1"
     transform="translate(0,-197)">
    <g
       id="g1508"
       transform="matrix(9.1378756,0,0,9.1378756,-1449.2592,-2798.3056)">
      <g
         id="g1601"
         transform="matrix(10.531271,0,0,10.531271,-1520.613,-3132.3251)">
        <g
           id="g2433"
           transform="matrix(2.1681138,0,0,2.1681138,-186.5522,-384.20369)">
          <g
             transform="matrix(0.05220054,0,0,-0.05220054,159.65565,328.94219)"
             id="g342-6">
            <path
               inkscape:connector-curvature="0"
               id="path344-2"
               style="fill:#000000;fill-opacity:1;fill-rule:nonzero;stroke:none"
               d="M 0,0 V -1.885 H 1.489 L 3.177,-3.471 V 1.787 L 1.587,0.05 Z" />
          </g>
          <g
             transform="matrix(0.05220054,0,0,-0.05220054,159.85793,328.92175)"
             id="g346-9">
            <path
               inkscape:connector-curvature="0"
               id="path348-1"
               style="fill:none;stroke:#000000;stroke-width:0.391;stroke-linecap:round;stroke-linejoin:miter;stroke-miterlimit:10;stroke-dasharray:none;stroke-opacity:1"
               d="M 0,0 C 0,0 0.823,-0.811 0,-2.468" />
          </g>
          <g
             transform="matrix(0.05220054,0,0,-0.05220054,159.89968,328.88357)"
             id="g350-2">
            <path
               inkscape:connector-curvature="0"
               id="path352-7"
               style="fill:none;stroke:#000000;stroke-width:0.391;stroke-linecap:round;stroke-linejoin:miter;stroke-miterlimit:10;stroke-dasharray:none;stroke-opacity:1"
               d="M 0,0 C 0,0 1.531,-1.577 0,-3.862" />
          </g>
          <g
             transform="matrix(0.05220054,0,0,-0.05220054,159.93521,328.84416)"
             id="g354-0">
            <path
               inkscape:connector-curvature="0"
               id="path356-9"
               style="fill:none;stroke:#000000;stroke-width:0.391;stroke-linecap:round;stroke-linejoin:miter;stroke-miterlimit:10;stroke-dasharray:none;stroke-opacity:1"
               d="M 0,0 C 0,0 2.258,-2.263 0,-5.349" />
          </g>
        </g>
      </g>
    </g>
  </g>
</svg>
