<?xml version="1.0" encoding="UTF-8" standalone="no"?>
<!-- Created with Inkscape (http://www.inkscape.org/) -->

<svg
   xmlns:dc="http://purl.org/dc/elements/1.1/"
   xmlns:cc="http://creativecommons.org/ns#"
   xmlns:rdf="http://www.w3.org/1999/02/22-rdf-syntax-ns#"
   xmlns:svg="http://www.w3.org/2000/svg"
   xmlns="http://www.w3.org/2000/svg"
   xmlns:sodipodi="http://sodipodi.sourceforge.net/DTD/sodipodi-0.dtd"
   xmlns:inkscape="http://www.inkscape.org/namespaces/inkscape"
   version="1.1"
   id="svg2"
   xml:space="preserve"
   width="102mm"
   height="35mm"
   viewBox="0 0 385.5118 132.28347"
   sodipodi:docname="XRCB-logo-mobile-vectorial.svg"
   inkscape:version="0.92.4 (5da689c313, 2019-01-14)">
  <metadata
   id="metadata8">
    <rdf:RDF>
      <cc:Work
   rdf:about="">
        <dc:format>image/svg+xml</dc:format>
        <dc:type
   rdf:resource="http://purl.org/dc/dcmitype/StillImage" />
        <dc:title>
        </dc:title>
      </cc:Work>
    </rdf:RDF>
  </metadata>
  <defs
   id="defs6">
    <clipPath
   clipPathUnits="userSpaceOnUse"
   id="clipPath18">
      <path
   d="M 97.646,15.915 H 215.622 V 100 H 97.646 Z"
   id="path16"
   inkscape:connector-curvature="0" />
    </clipPath>
  </defs>
  <sodipodi:namedview
   pagecolor="#ffffff"
   bordercolor="#666666"
   borderopacity="1"
   objecttolerance="10"
   gridtolerance="10"
   guidetolerance="10"
   inkscape:pageopacity="0"
   inkscape:pageshadow="2"
   inkscape:window-width="1920"
   inkscape:window-height="1080"
   id="namedview4"
   showgrid="false"
   inkscape:zoom="0.90311416"
   inkscape:cx="-299.51916"
   inkscape:cy="66.666664"
   inkscape:window-x="1366"
   inkscape:window-y="0"
   inkscape:window-maximized="1"
   inkscape:current-layer="g10"
   units="mm" />
  <g
   id="g10"
   inkscape:groupmode="layer"
   inkscape:label="Logo Mobile"
   transform="matrix(1.3333333,0,0,-1.3333333,0,132.28348)">
    <g
   id="g12">
      <g
   id="g14"
   clip-path="url(#clipPath18)">
        <g
   id="g20"
   transform="translate(102.1582,22.373)">
          <path
   d="m 0,0 h 3.327 c 1.303,0 2.198,-0.564 2.198,-1.986 0,-1.438 -1.05,-1.827 -2.256,-1.827 H 0 Z m -3.055,-6.187 h 6.731 c 2.511,0 4.903,1.208 4.903,4.027 0,1.731 -0.856,3.035 -2.548,3.521 1.205,0.584 1.886,1.537 1.886,2.899 0,2.588 -1.789,3.443 -4.436,3.443 H -3.055 Z M 0,5.33 h 2.86 c 1.09,0 2.1,-0.273 2.1,-1.594 C 4.96,2.567 4.163,2.082 3.094,2.082 H 0 Z m 15.835,-7.625 c 0,-0.605 -0.078,-2.316 -2.236,-2.316 -0.897,0 -1.694,0.254 -1.694,1.285 0,1.011 0.778,1.303 1.635,1.477 0.855,0.156 1.827,0.175 2.295,0.584 z m -3.618,3.074 c 0.096,1.088 0.777,1.518 1.827,1.518 0.975,0 1.791,-0.176 1.791,-1.363 0,-1.129 -1.577,-1.071 -3.268,-1.324 -1.713,-0.233 -3.424,-0.778 -3.424,-3.053 0,-2.063 1.517,-3.015 3.424,-3.015 1.225,0 2.508,0.33 3.385,1.244 0.021,-0.33 0.096,-0.661 0.194,-0.973 h 2.801 c -0.253,0.41 -0.349,1.325 -0.349,2.239 v 5.231 c 0,2.413 -2.414,2.862 -4.417,2.862 -2.256,0 -4.572,-0.779 -4.727,-3.366 z m 7.741,-6.966 h 2.764 v 4.535 c 0,1.769 0.699,3.228 2.723,3.228 0.33,0 0.738,-0.04 0.992,-0.099 v 2.57 c -0.175,0.058 -0.409,0.098 -0.604,0.098 -1.342,0 -2.704,-0.875 -3.208,-2.141 h -0.04 v 1.867 h -2.627 z m 16.341,6.519 c -0.175,2.566 -2.355,3.813 -4.728,3.813 -3.268,0 -5.134,-2.317 -5.134,-5.449 0,-3.014 2.042,-5.154 5.076,-5.154 2.646,0 4.495,1.458 4.845,4.124 h -2.666 c -0.174,-1.226 -0.914,-2.043 -2.198,-2.043 -1.732,0 -2.296,1.731 -2.296,3.171 0,1.477 0.584,3.269 2.354,3.269 1.148,0 1.867,-0.605 2.044,-1.731 z m 10.757,-2.16 c 0.194,3.092 -1.46,5.973 -4.883,5.973 -3.053,0 -5.135,-2.297 -5.135,-5.313 0,-3.111 1.964,-5.29 5.135,-5.29 2.276,0 3.931,1.012 4.708,3.384 h -2.432 c -0.175,-0.622 -1.07,-1.303 -2.178,-1.303 -1.537,0 -2.393,0.797 -2.471,2.549 z m -7.256,1.75 c 0.039,0.779 0.546,2.141 2.295,2.141 1.343,0 1.946,-0.74 2.199,-2.141 z m 8.58,-6.109 h 2.761 V 7.703 H 48.38 Z m 3.849,5.019 c 0,-3.189 2.044,-5.29 5.195,-5.29 3.171,0 5.214,2.101 5.214,5.29 0,3.211 -2.043,5.313 -5.214,5.313 -3.151,0 -5.195,-2.102 -5.195,-5.313 m 2.764,0 c 0,1.615 0.564,3.231 2.431,3.231 1.888,0 2.451,-1.616 2.451,-3.231 0,-1.594 -0.563,-3.209 -2.451,-3.209 -1.867,0 -2.431,1.615 -2.431,3.209 m 8.656,-5.019 h 2.762 v 5.273 c 0,2.043 0.643,2.879 2.139,2.879 1.284,0 1.772,-0.817 1.772,-2.471 v -5.681 h 2.762 V 0 c 0,2.488 -0.74,4.145 -3.678,4.145 -1.166,0 -2.373,-0.545 -3.073,-1.675 h -0.057 v 1.401 h -2.627 z m 17.02,3.892 c 0,-0.605 -0.076,-2.316 -2.236,-2.316 -0.895,0 -1.692,0.254 -1.692,1.285 0,1.011 0.778,1.303 1.634,1.477 0.855,0.156 1.828,0.175 2.294,0.584 z m -3.616,3.074 c 0.095,1.088 0.776,1.518 1.827,1.518 0.974,0 1.789,-0.176 1.789,-1.363 0,-1.129 -1.575,-1.071 -3.268,-1.324 -1.712,-0.233 -3.422,-0.778 -3.422,-3.053 0,-2.063 1.516,-3.015 3.422,-3.015 1.226,0 2.511,0.33 3.386,1.244 0.019,-0.33 0.098,-0.661 0.194,-0.973 h 2.8 c -0.251,0.41 -0.347,1.325 -0.347,2.239 v 5.231 c 0,2.413 -2.413,2.862 -4.418,2.862 -2.256,0 -4.571,-0.779 -4.728,-3.366 z"
   style="fill:#000000;fill-opacity:1;fill-rule:nonzero;stroke:none"
   id="path22"
   inkscape:connector-curvature="0" />
        </g>
        <g
   id="g24"
   transform="translate(111.3203,43.9336)">
          <path
   d="m 0,0 c -0.369,3.21 -2.937,5 -5.992,5 -4.298,0 -6.827,-3.209 -6.827,-7.334 0,-4.007 2.529,-7.216 6.827,-7.216 3.406,0 5.798,2.216 6.109,5.679 H -2.84 c -0.233,-1.828 -1.284,-3.111 -3.152,-3.111 -2.742,0 -3.773,2.334 -3.773,4.648 0,2.433 1.031,4.766 3.773,4.766 1.517,0 2.841,-1.051 3.036,-2.432 z m 0.785,-4.2 c 0,-3.191 2.043,-5.293 5.194,-5.293 3.171,0 5.213,2.102 5.213,5.293 0,3.208 -2.042,5.31 -5.213,5.31 -3.151,0 -5.194,-2.102 -5.194,-5.31 m 2.763,0 c 0,1.612 0.564,3.227 2.431,3.227 1.887,0 2.451,-1.615 2.451,-3.227 0,-1.597 -0.564,-3.21 -2.451,-3.21 -1.867,0 -2.431,1.613 -2.431,3.21 m 8.701,-5.021 h 2.763 v 5.836 c 0,1.965 1.322,2.316 1.867,2.316 1.751,0 1.673,-1.342 1.673,-2.509 v -5.643 h 2.762 v 5.604 c 0,1.263 0.292,2.548 1.849,2.548 1.576,0 1.692,-1.109 1.692,-2.451 v -5.701 h 2.764 v 6.731 c 0,2.608 -1.538,3.6 -3.678,3.6 -1.4,0 -2.453,-0.798 -3.034,-1.674 -0.546,1.207 -1.674,1.674 -2.938,1.674 -1.303,0 -2.354,-0.604 -3.074,-1.635 H 14.856 V 0.838 H 12.249 Z M 38.421,0.838 h -2.763 v -5.273 c 0,-2.042 -0.642,-2.877 -2.139,-2.877 -1.285,0 -1.771,0.816 -1.771,2.468 v 5.682 h -2.762 v -6.186 c 0,-2.491 0.739,-4.145 3.676,-4.145 1.167,0 2.374,0.544 3.073,1.673 h 0.059 v -1.401 h 2.627 z m 1.678,-10.059 h 2.762 v 5.273 c 0,2.043 0.642,2.879 2.14,2.879 1.284,0 1.771,-0.816 1.771,-2.47 v -5.682 h 2.761 v 6.186 c 0,2.491 -0.738,4.145 -3.676,4.145 -1.167,0 -2.373,-0.545 -3.072,-1.674 h -0.059 v 1.402 h -2.627 z m 10.804,0 h 2.762 V 0.838 h -2.762 z m 2.762,13.89 H 50.903 V 2.395 h 2.762 z M 58.923,3.852 H 56.162 V 0.838 h -1.674 v -1.85 h 1.674 v -5.931 c 0,-2.006 1.478,-2.395 3.171,-2.395 0.544,0 1.147,0.02 1.614,0.098 v 2.158 c -0.293,-0.057 -0.565,-0.076 -0.856,-0.076 -0.935,0 -1.168,0.232 -1.168,1.166 v 4.98 h 2.024 v 1.85 h -2.024 z m 9.578,-9.181 c 0,-0.605 -0.079,-2.316 -2.238,-2.316 -0.894,0 -1.693,0.254 -1.693,1.285 0,1.012 0.779,1.303 1.636,1.477 0.856,0.156 1.827,0.176 2.295,0.584 z m -3.62,3.073 c 0.099,1.089 0.778,1.518 1.83,1.518 0.973,0 1.79,-0.176 1.79,-1.363 0,-1.128 -1.576,-1.071 -3.27,-1.322 -1.71,-0.234 -3.421,-0.777 -3.421,-3.054 0,-2.062 1.517,-3.016 3.421,-3.016 1.227,0 2.511,0.331 3.386,1.245 0.019,-0.33 0.098,-0.66 0.194,-0.973 h 2.802 c -0.253,0.408 -0.35,1.324 -0.35,2.239 v 5.232 c 0,2.411 -2.412,2.86 -4.416,2.86 -2.258,0 -4.573,-0.778 -4.728,-3.366 z m 1.441,4.338 h 1.926 L 66.38,4.845 h -3.053 z m 6.66,-11.303 h 2.762 v 4.534 c 0,1.769 0.7,3.229 2.723,3.229 0.33,0 0.741,-0.038 0.991,-0.098 v 2.568 c -0.172,0.059 -0.406,0.098 -0.602,0.098 -1.342,0 -2.703,-0.878 -3.209,-2.139 h -0.04 v 1.867 h -2.625 z m 7.612,0 h 2.763 V 0.838 h -2.763 z m 2.762,13.89 H 80.593 V 2.395 h 2.763 z m 10.902,-9.531 c 0.193,3.092 -1.461,5.972 -4.883,5.972 -3.055,0 -5.137,-2.296 -5.137,-5.31 0,-3.112 1.965,-5.293 5.137,-5.293 2.275,0 3.928,1.013 4.706,3.386 H 91.65 C 91.475,-6.73 90.58,-7.41 89.47,-7.41 c -1.536,0 -2.392,0.797 -2.468,2.548 z m -7.256,1.751 c 0.038,0.777 0.542,2.138 2.294,2.138 1.342,0 1.946,-0.738 2.198,-2.138 z m 7.98,-2.841 c 0.118,-2.664 2.393,-3.541 4.727,-3.541 2.296,0 4.592,0.856 4.592,3.501 0,1.869 -1.577,2.453 -3.192,2.82 -1.574,0.371 -3.13,0.508 -3.13,1.5 0,0.817 0.913,0.934 1.537,0.934 0.991,0 1.808,-0.291 1.886,-1.363 h 2.627 c -0.216,2.47 -2.238,3.211 -4.435,3.211 -2.16,0 -4.378,-0.663 -4.378,-3.229 0,-1.772 1.596,-2.335 3.19,-2.686 1.983,-0.427 3.131,-0.718 3.131,-1.555 0,-0.974 -1.01,-1.285 -1.808,-1.285 -1.088,0 -2.1,0.487 -2.121,1.693 z"
   style="fill:#000000;fill-opacity:1;fill-rule:nonzero;stroke:none"
   id="path26"
   inkscape:connector-curvature="0" />
        </g>
        <g
   id="g28"
   transform="translate(99.1035,53.2393)">
          <path
   d="m 0,0 h 3.055 v 5.428 h 3.054 c 1.537,0 2.1,-0.641 2.315,-2.101 C 8.58,2.218 8.541,0.876 8.911,0 h 3.053 c -0.544,0.779 -0.525,2.414 -0.583,3.289 -0.097,1.4 -0.527,2.858 -2.024,3.248 v 0.039 c 1.538,0.622 2.199,1.848 2.199,3.482 0,2.101 -1.577,3.832 -4.065,3.832 H 0 Z m 3.055,11.516 h 3.346 c 1.362,0 2.1,-0.583 2.1,-1.925 0,-1.4 -0.738,-1.984 -2.1,-1.984 H 3.055 Z M 19.239,3.892 c 0,-0.603 -0.077,-2.316 -2.237,-2.316 -0.895,0 -1.692,0.252 -1.692,1.284 0,1.013 0.777,1.304 1.633,1.478 0.857,0.156 1.83,0.176 2.296,0.583 z m -3.617,3.073 c 0.096,1.089 0.777,1.517 1.827,1.517 0.973,0 1.79,-0.174 1.79,-1.361 0,-1.129 -1.575,-1.07 -3.267,-1.323 C 14.26,5.564 12.548,5.02 12.548,2.744 c 0,-2.062 1.516,-3.015 3.424,-3.015 1.225,0 2.509,0.33 3.385,1.245 C 19.375,0.643 19.453,0.313 19.55,0 h 2.803 C 22.099,0.409 22.001,1.324 22.001,2.238 V 7.47 c 0,2.414 -2.412,2.861 -4.415,2.861 -2.256,0 -4.571,-0.778 -4.728,-3.366 z m 1.438,4.338 h 1.926 l -1.868,2.762 H 14.064 Z M 30.542,0 h 2.625 V 13.89 H 30.405 V 8.832 h -0.038 c -0.623,0.993 -1.791,1.499 -2.976,1.499 -2.956,0 -4.456,-2.51 -4.456,-5.214 0,-2.781 1.479,-5.388 4.512,-5.388 1.285,0 2.413,0.467 3.056,1.555 h 0.039 z m -0.039,5.058 c 0,-1.653 -0.545,-3.248 -2.373,-3.248 -1.713,0 -2.433,1.654 -2.433,3.229 0,1.654 0.622,3.21 2.433,3.21 1.789,0 2.373,-1.556 2.373,-3.191 M 34.549,0 h 2.762 v 10.058 h -2.762 z m 2.762,13.89 h -2.762 v -2.276 h 2.762 z M 38.4,5.02 c 0,-3.192 2.042,-5.291 5.193,-5.291 3.172,0 5.214,2.099 5.214,5.291 0,3.209 -2.042,5.311 -5.214,5.311 -3.151,0 -5.193,-2.102 -5.193,-5.311 m 2.762,0 c 0,1.614 0.565,3.229 2.431,3.229 1.888,0 2.452,-1.615 2.452,-3.229 0,-1.596 -0.564,-3.21 -2.452,-3.21 -1.866,0 -2.431,1.614 -2.431,3.21 m 8.17,-1.751 c 0.117,-2.665 2.392,-3.54 4.728,-3.54 2.295,0 4.591,0.856 4.591,3.501 0,1.868 -1.577,2.452 -3.191,2.821 -1.576,0.369 -3.132,0.505 -3.132,1.498 0,0.816 0.915,0.933 1.537,0.933 0.992,0 1.809,-0.291 1.887,-1.361 h 2.625 c -0.213,2.47 -2.236,3.21 -4.435,3.21 -2.159,0 -4.376,-0.662 -4.376,-3.229 0,-1.771 1.595,-2.334 3.19,-2.685 1.985,-0.427 3.132,-0.719 3.132,-1.557 0,-0.973 -1.011,-1.284 -1.809,-1.284 -1.09,0 -2.101,0.487 -2.12,1.693 z"
   style="fill:#000000;fill-opacity:1;fill-rule:nonzero;stroke:none"
   id="path30"
   inkscape:connector-curvature="0" />
        </g>
        <g
   id="g32"
   transform="translate(97.6455,71.7666)">
          <path
   d="M 0,0 H 3.443 L 6.536,4.806 9.57,0 h 3.638 l -4.843,7.255 4.454,6.634 H 9.473 L 6.653,9.454 3.929,13.889 H 0.388 L 4.863,7.275 Z m 20.017,3.891 c 0,-0.603 -0.078,-2.315 -2.238,-2.315 -0.894,0 -1.692,0.252 -1.692,1.284 0,1.012 0.779,1.303 1.634,1.478 0.856,0.156 1.829,0.175 2.296,0.584 z m -3.618,3.073 c 0.097,1.09 0.777,1.517 1.829,1.517 0.972,0 1.789,-0.174 1.789,-1.361 0,-1.128 -1.575,-1.07 -3.268,-1.323 -1.712,-0.234 -3.424,-0.778 -3.424,-3.053 0,-2.063 1.518,-3.016 3.424,-3.016 1.225,0 2.509,0.33 3.385,1.245 C 20.153,0.642 20.231,0.312 20.327,0 h 2.802 c -0.253,0.408 -0.35,1.323 -0.35,2.237 v 5.232 c 0,2.413 -2.413,2.86 -4.416,2.86 -2.257,0 -4.571,-0.778 -4.727,-3.365 z M 24.141,0 h 2.761 v 4.533 c 0,1.77 0.701,3.229 2.724,3.229 0.332,0 0.74,-0.039 0.992,-0.097 v 2.567 c -0.175,0.059 -0.408,0.097 -0.602,0.097 -1.342,0 -2.704,-0.875 -3.21,-2.14 h -0.04 v 1.868 h -2.625 z m 6.516,0 H 33.75 L 35.851,3.171 37.952,0 h 3.151 l -3.714,5.349 3.306,4.708 H 37.641 L 35.891,7.43 34.12,10.057 h -3.151 l 3.306,-4.766 z m 16.982,3.891 c 0,-0.603 -0.078,-2.315 -2.237,-2.315 -0.895,0 -1.692,0.252 -1.692,1.284 0,1.012 0.777,1.303 1.634,1.478 0.856,0.156 1.829,0.175 2.295,0.584 z m -3.618,3.073 c 0.097,1.09 0.778,1.517 1.829,1.517 0.972,0 1.789,-0.174 1.789,-1.361 0,-1.128 -1.575,-1.07 -3.269,-1.323 -1.711,-0.234 -3.423,-0.778 -3.423,-3.053 0,-2.063 1.518,-3.016 3.423,-3.016 1.227,0 2.51,0.33 3.386,1.245 C 47.776,0.642 47.853,0.312 47.95,0 h 2.801 c -0.252,0.408 -0.349,1.323 -0.349,2.237 v 5.232 c 0,2.413 -2.413,2.86 -4.416,2.86 -2.257,0 -4.571,-0.778 -4.727,-3.365 z"
   style="fill:#000000;fill-opacity:1;fill-rule:nonzero;stroke:none"
   id="path34"
   inkscape:connector-curvature="0" />
        </g>
      </g>
    </g>
    <g
   id="g36"
   transform="translate(24.3345,85.4751)">
      <path
   d="M 0,0 -2.601,-4.09 -5.112,0 h -3.264 l 4.126,-6.099 -4.485,-6.708 h 3.175 l 2.852,4.43 2.798,-4.43 H 3.444 L -1.022,-6.116 3.085,0 Z"
   style="fill:#000000;fill-opacity:1;fill-rule:nonzero;stroke:none"
   id="path38"
   inkscape:connector-curvature="0" />
    </g>
    <g
   id="g40"
   transform="translate(29.9614,58.3198)">
      <path
   d="M 0,0 H 3.174 L 6.026,4.43 8.824,0 h 3.354 l -4.466,6.69 4.107,6.117 H 8.734 L 6.134,8.716 3.623,12.807 H 0.358 L 4.484,6.708 Z"
   style="fill:#000000;fill-opacity:1;fill-rule:nonzero;stroke:none"
   id="path42"
   inkscape:connector-curvature="0" />
    </g>
    <g
   id="g44"
   transform="translate(44.2544,44.0264)">
      <path
   d="M 0,0 H 3.175 L 6.026,4.43 8.825,0 h 3.354 L 7.712,6.69 11.82,12.807 H 8.735 L 6.134,8.717 3.623,12.807 H 0.358 L 4.484,6.708 Z"
   style="fill:#000000;fill-opacity:1;fill-rule:nonzero;stroke:none"
   id="path46"
   inkscape:connector-curvature="0" />
    </g>
    <g
   id="g48"
   transform="translate(29.9404,29.7129)">
      <path
   d="M 0,0 H 3.175 L 6.027,4.43 8.825,0 h 3.354 L 7.712,6.689 11.82,12.807 H 8.735 l -2.601,-4.09 -2.51,4.09 H 0.359 L 4.484,6.708 Z"
   style="fill:#000000;fill-opacity:1;fill-rule:nonzero;stroke:none"
   id="path50"
   inkscape:connector-curvature="0" />
    </g>
    <g
   id="g52"
   transform="translate(58.3799,58.1519)">
      <path
   d="M 0,0 H 3.174 L 6.026,4.43 8.825,0 h 3.354 l -4.466,6.69 4.106,6.116 H 8.734 L 6.134,8.717 3.623,12.806 H 0.358 L 4.484,6.708 Z"
   style="fill:#000000;fill-opacity:1;fill-rule:nonzero;stroke:none"
   id="path54"
   inkscape:connector-curvature="0" />
    </g>
    <g
   id="g56"
   transform="translate(81.7275,85.5718)">
      <path
   d="M 0,0 -2.6,-4.089 -5.111,0 h -3.265 l 4.126,-6.098 -4.484,-6.708 h 3.174 l 2.853,4.43 2.798,-4.43 H 3.444 L -1.021,-6.116 3.085,0 Z"
   style="fill:#000000;fill-opacity:1;fill-rule:nonzero;stroke:none"
   id="path58"
   inkscape:connector-curvature="0" />
    </g>
    <g
   id="g60"
   transform="translate(24.3247,28.168)">
      <path
   d="M 0,0 -2.601,-4.09 -5.112,0 h -3.264 l 4.125,-6.098 -4.484,-6.707 h 3.175 l 2.851,4.429 2.799,-4.429 H 3.443 L -1.022,-6.116 3.084,0 Z"
   style="fill:#000000;fill-opacity:1;fill-rule:nonzero;stroke:none"
   id="path62"
   inkscape:connector-curvature="0" />
    </g>
    <g
   id="g64"
   transform="translate(58.6538,29.627)">
      <path
   d="M 0,0 H 3.174 L 6.026,4.431 8.825,0 h 3.354 L 7.712,6.689 11.82,12.807 H 8.734 L 6.134,8.718 3.623,12.807 H 0.358 L 4.483,6.709 Z"
   style="fill:#000000;fill-opacity:1;fill-rule:nonzero;stroke:none"
   id="path66"
   inkscape:connector-curvature="0" />
    </g>
    <g
   id="g68"
   transform="translate(73.0659,15.2148)">
      <path
   d="M 0,0 H 3.175 L 6.026,4.431 8.824,0 h 3.354 l -4.466,6.689 4.107,6.118 H 8.735 L 6.134,8.717 3.623,12.807 H 0.358 L 4.484,6.709 Z"
   style="fill:#000000;fill-opacity:1;fill-rule:nonzero;stroke:none"
   id="path70"
   inkscape:connector-curvature="0" />
    </g>
  </g>
</svg>