<?xml version="1.0" encoding="UTF-8"?>
<svg width="53px" height="53px" viewBox="0 0 53 53" version="1.1" xmlns="http://www.w3.org/2000/svg" xmlns:xlink="http://www.w3.org/1999/xlink">
    <title>Play-Dark</title>
    <defs>
        <polygon id="path-1" points="6.625 6.625 6.625 46.375 46.375 26.5"></polygon>
    </defs>
    <g id="Play-Dark" stroke="none" stroke-width="1" fill="none" fill-rule="evenodd">
        <g id="icon/media-play">
            <mask id="mask-2" fill="white">
                <use xlink:href="#path-1"></use>
            </mask>
            <use id="Shape" fill="#000000" fill-rule="nonzero" xlink:href="#path-1"></use>
            <g id="Group" mask="url(#mask-2)" fill="#FFFFFF">
                <g id="Color">
                    <rect id="Rectangle" x="0" y="0" width="53" height="53"></rect>
                </g>
            </g>
        </g>
    </g>
</svg>