<?xml version="1.0" encoding="UTF-8"?>
<svg width="256px" height="256px" viewBox="0 0 256 256" version="1.1" xmlns="http://www.w3.org/2000/svg" xmlns:xlink="http://www.w3.org/1999/xlink">
    <title>lightPauseButton</title>
    <defs>
        <path d="M0,0 L0,256 L85.3333333,256 L85.3333333,0 L0,0 Z M170.666667,0 L170.666667,256 L256,256 L256,0 L170.666667,0 Z" id="path-1"></path>
    </defs>
    <g id="lightPauseButton" stroke="none" stroke-width="1" fill="none" fill-rule="evenodd">
        <g id="icon/media-stop">
            <mask id="mask-2" fill="white">
                <use xlink:href="#path-1"></use>
            </mask>
            <use id="Shape" fill="#000000" fill-rule="nonzero" xlink:href="#path-1"></use>
            <g id="Group" mask="url(#mask-2)" fill="#000000">
                <g id="Color">
                    <rect id="Rectangle" x="0" y="0" width="256" height="256"></rect>
                </g>
            </g>
        </g>
    </g>
</svg>