<?xml version="1.0" encoding="UTF-8" standalone="no"?>
<!-- Created with Inkscape (http://www.inkscape.org/) -->

<svg
   xmlns:dc="http://purl.org/dc/elements/1.1/"
   xmlns:cc="http://creativecommons.org/ns#"
   xmlns:rdf="http://www.w3.org/1999/02/22-rdf-syntax-ns#"
   xmlns:svg="http://www.w3.org/2000/svg"
   xmlns="http://www.w3.org/2000/svg"
   xmlns:sodipodi="http://sodipodi.sourceforge.net/DTD/sodipodi-0.dtd"
   xmlns:inkscape="http://www.inkscape.org/namespaces/inkscape"
   width="13.229167mm"
   height="17.00465mm"
   viewBox="0 0 13.229167 17.00465"
   version="1.1"
   id="svg9524"
   sodipodi:docname="minefi.svg"
   inkscape:version="0.92.2 (5c3e80d, 2017-08-06)">
  <defs
     id="defs9518">
    <clipPath
       id="clip1">
      <path
         inkscape:connector-curvature="0"
         id="path10221"
         d="M 0,0 H 119.03906 V 153.01172 H 0 Z m 0,0" />
    </clipPath>
    <clipPath
       id="clip2">
      <path
         inkscape:connector-curvature="0"
         id="path10224"
         d="m 0,79 h 119.03906 v 1 H 0 Z m 0,0" />
    </clipPath>
  </defs>
  <sodipodi:namedview
     id="base"
     pagecolor="#ffffff"
     bordercolor="#666666"
     borderopacity="1.0"
     inkscape:pageopacity="0.0"
     inkscape:pageshadow="2"
     inkscape:zoom="0.7"
     inkscape:cx="-430.52628"
     inkscape:cy="-3.0011589"
     inkscape:document-units="mm"
     inkscape:current-layer="layer1"
     showgrid="false"
     inkscape:window-width="1920"
     inkscape:window-height="1058"
     inkscape:window-x="1592"
     inkscape:window-y="-8"
     inkscape:window-maximized="1"
     fit-margin-top="0"
     fit-margin-left="0"
     fit-margin-right="0"
     fit-margin-bottom="0" />
  <metadata
     id="metadata9521">
    <rdf:RDF>
      <cc:Work
         rdf:about="">
        <dc:format>image/svg+xml</dc:format>
        <dc:type
           rdf:resource="http://purl.org/dc/dcmitype/StillImage" />
        <dc:title></dc:title>
      </cc:Work>
    </rdf:RDF>
  </metadata>
  <g
     inkscape:label="Calque 1"
     inkscape:groupmode="layer"
     id="layer1"
     transform="translate(-83.343745,-63.10046)">
    <g
       id="g10055">
      <path
         id="path10229"
         d="m 83.371528,63.128243 c 0,5.651721 0,11.303875 0,16.955595 4.391924,0 8.783413,0 13.175337,0 0,-5.65172 0,-11.303874 0,-16.955595 -4.391924,0 -8.783413,0 -13.175337,0"
         style="fill:#ffffff;fill-opacity:1;fill-rule:nonzero;stroke:none;stroke-width:0.11113299"
         inkscape:connector-curvature="0" />
      <g
         transform="matrix(0.11113299,0,0,0.11113299,83.343745,63.10046)"
         id="g10233"
         clip-path="url(#clip1)"
         style="clip-rule:nonzero">
        <path
           id="path10231"
           transform="matrix(1,0,0,-1,0.25,0.25)"
           d="m 0,0 c 0,-50.855469 0,-101.71484 0,-152.57031 39.519531,0 79.035156,0 118.55469,0 0,50.85547 0,101.714841 0,152.57031 C 79.035156,0 39.519531,0 0,0 Z m 0,0"
           style="fill:none;stroke:#211e1e;stroke-width:0.5;stroke-linecap:butt;stroke-linejoin:miter;stroke-miterlimit:4;stroke-opacity:1"
           inkscape:connector-curvature="0" />
      </g>
      <g
         transform="matrix(0.11113299,0,0,0.11113299,83.343745,63.10046)"
         id="g10237"
         clip-path="url(#clip2)"
         style="clip-rule:nonzero">
        <path
           id="path10235"
           transform="matrix(1,0,0,-1,0,79.62)"
           d="M 0,-0.00109375 H 119.05469"
           style="fill:none;stroke:#211e1e;stroke-width:0.5;stroke-linecap:butt;stroke-linejoin:miter;stroke-miterlimit:4;stroke-opacity:1"
           inkscape:connector-curvature="0" />
      </g>
      <path
         id="path10239"
         d="m 85.680143,77.150969 c 0.03646,0 0.06164,0.0026 0.0764,0.0078 0.0178,0.0078 0.03169,0.01867 0.04081,0.03343 0.0091,0.01433 0.0178,0.04081 0.02518,0.07944 h 0.02127 l -0.0082,-0.161056 h -0.566952 v 0.01997 h 0.02605 c 0.03039,0 0.05209,0.0074 0.06512,0.02171 0.0096,0.01086 0.01432,0.03994 0.01432,0.08639 v 0.477959 c 0,0.03603 -0.0022,0.05947 -0.0065,0.0712 -0.0039,0.01172 -0.01172,0.0204 -0.02344,0.02605 -0.01563,0.0082 -0.03212,0.01259 -0.04949,0.01259 h -0.02605 v 0.01997 h 0.566952 l 0.06382,-0.184498 h -0.02171 c -0.02344,0.04515 -0.04645,0.07901 -0.06902,0.101583 -0.01736,0.01693 -0.0356,0.02822 -0.05426,0.03386 -0.01867,0.0061 -0.04905,0.0087 -0.09073,0.0087 h -0.12459 c -0.0204,0 -0.0343,-0.0017 -0.04124,-0.0061 -0.0074,-0.0043 -0.01259,-0.0095 -0.01519,-0.01693 -0.003,-0.0069 -0.0043,-0.02648 -0.0043,-0.05904 v -0.24267 h 0.16149 c 0.03082,0 0.0534,0.0035 0.06859,0.01086 0.01476,0.0069 0.02518,0.01693 0.03169,0.02952 0.0052,0.01041 0.01042,0.03343 0.01519,0.06903 h 0.0204 V 77.33461 h -0.0204 c -0.0022,0.04211 -0.01259,0.0712 -0.03126,0.08813 -0.01432,0.01259 -0.04211,0.0191 -0.08422,0.0191 h -0.16149 v -0.290855 z m 0.286948,-0.04037 -0.0087,0.172343 h 0.0204 c 0.0026,-0.03299 0.01085,-0.05947 0.02388,-0.07901 0.01346,-0.01953 0.02952,-0.03299 0.04862,-0.0395 0.01433,-0.0052 0.03864,-0.0078 0.07293,-0.0078 h 0.08856 v 0.562176 c 0,0.04124 -0.0039,0.06772 -0.01172,0.07944 -0.01302,0.01867 -0.03516,0.02822 -0.06642,0.02822 h -0.02605 v 0.01997 h 0.312128 v -0.01997 h -0.02561 c -0.02865,0 -0.04949,-0.0078 -0.06338,-0.02301 -0.01,-0.01129 -0.01476,-0.0395 -0.01476,-0.08465 v -0.562176 h 0.103753 c 0.03039,0 0.0547,0.0052 0.07337,0.01476 0.01867,0.01 0.03386,0.02561 0.04471,0.04645 0.0069,0.01302 0.01259,0.03473 0.0165,0.06512 h 0.0204 l -0.0078,-0.172343 z m 1.241998,0.735822 c 0.142824,0 0.249181,-0.0382 0.319074,-0.115041 0.06251,-0.06859 0.09333,-0.15411 0.09333,-0.25656 0,-0.0764 -0.01736,-0.143692 -0.05253,-0.201863 -0.03473,-0.05817 -0.08074,-0.09985 -0.138048,-0.125025 -0.0573,-0.02474 -0.141087,-0.03733 -0.250917,-0.03733 H 86.88046 v 0.01997 h 0.02735 c 0.02778,0 0.04905,0.0078 0.06295,0.02388 0.01042,0.01172 0.01519,0.04037 0.01519,0.08639 v 0.475354 c 0,0.04167 -0.0039,0.06859 -0.01172,0.08031 -0.01302,0.01997 -0.03516,0.02995 -0.06642,0.02995 h -0.02735 v 0.01997 z m -0.118947,-0.678953 c 0.04167,-0.01041 0.07901,-0.01563 0.111567,-0.01563 0.08682,0 0.157584,0.02909 0.21315,0.08769 0.05513,0.05904 0.08292,0.138916 0.08292,0.240498 0,0.101149 -0.02778,0.181026 -0.08292,0.240066 -0.05557,0.0586 -0.125025,0.08813 -0.208809,0.08813 -0.03126,0 -0.06989,-0.0048 -0.115908,-0.01476 z m 1.008011,-0.0165 c 0.03647,0 0.06208,0.0026 0.0764,0.0078 0.01823,0.0078 0.03169,0.01867 0.04081,0.03343 0.0096,0.01433 0.0178,0.04081 0.02518,0.07944 h 0.02127 l -0.0082,-0.161056 h -0.566952 v 0.01997 h 0.02605 c 0.03039,0 0.05209,0.0074 0.06512,0.02171 0.0096,0.01086 0.01432,0.03994 0.01432,0.08639 v 0.477959 c 0,0.03603 -0.0022,0.05947 -0.0065,0.0712 -0.0039,0.01172 -0.01215,0.0204 -0.02344,0.02605 -0.01563,0.0082 -0.03212,0.01259 -0.04949,0.01259 h -0.02605 v 0.01997 h 0.566952 l 0.06381,-0.184498 h -0.02171 c -0.02388,0.04515 -0.04645,0.07901 -0.06902,0.101583 -0.01736,0.01693 -0.0356,0.02822 -0.05426,0.03386 -0.0191,0.0061 -0.04905,0.0087 -0.09073,0.0087 h -0.12459 c -0.0204,0 -0.0343,-0.0017 -0.04124,-0.0061 -0.0074,-0.0043 -0.01259,-0.0095 -0.01519,-0.01693 -0.003,-0.0069 -0.0043,-0.02648 -0.0043,-0.05904 v -0.24267 h 0.16149 c 0.03082,0 0.0534,0.0035 0.06859,0.01086 0.01476,0.0069 0.02518,0.01693 0.03169,0.02952 0.0052,0.01041 0.01042,0.03343 0.01519,0.06903 h 0.0204 v -0.256127 h -0.0204 c -0.0022,0.04211 -0.01259,0.0712 -0.03126,0.08813 -0.01432,0.01259 -0.04211,0.0191 -0.08422,0.0191 h -0.16149 v -0.290855 z m 0.734086,-0.0573 c -0.0035,0.01693 -0.0082,0.02865 -0.01433,0.03386 -0.0061,0.0056 -0.01389,0.0087 -0.02301,0.0087 -0.0087,0 -0.02257,-0.0048 -0.04298,-0.01346 -0.04385,-0.01954 -0.08509,-0.02908 -0.124157,-0.02908 -0.06295,0 -0.114171,0.0191 -0.154978,0.0573 -0.04037,0.0382 -0.06078,0.08378 -0.06078,0.136311 0,0.03039 0.0069,0.05861 0.02084,0.08378 0.01346,0.02518 0.03386,0.04862 0.06034,0.06946 0.02648,0.02084 0.07163,0.04905 0.134575,0.08422 0.06295,0.0356 0.101149,0.0586 0.115475,0.06946 0.02084,0.01563 0.03647,0.03299 0.04645,0.05166 0.01,0.01823 0.01476,0.03647 0.01476,0.0547 0,0.03256 -0.01302,0.06078 -0.03951,0.08465 -0.02605,0.02388 -0.06164,0.0356 -0.106792,0.0356 -0.03907,0 -0.0751,-0.0087 -0.10766,-0.02605 -0.03299,-0.01736 -0.0573,-0.03907 -0.07336,-0.06512 -0.01563,-0.02648 -0.02822,-0.06599 -0.03777,-0.118947 h -0.01997 v 0.252653 h 0.01997 c 0.0026,-0.01693 0.0065,-0.02822 0.01172,-0.03386 0.0052,-0.0052 0.01215,-0.0078 0.02127,-0.0078 0.0096,0 0.03169,0.0056 0.06729,0.01693 0.03516,0.01129 0.05817,0.0178 0.06946,0.01997 0.0191,0.003 0.03907,0.0048 0.06034,0.0048 0.06772,0 0.123723,-0.0204 0.1667,-0.06077 0.04341,-0.04037 0.06512,-0.08813 0.06512,-0.144127 0,-0.02909 -0.0069,-0.0573 -0.0204,-0.08378 -0.01389,-0.02691 -0.03299,-0.05036 -0.05817,-0.06989 -0.02518,-0.01953 -0.07206,-0.04819 -0.140652,-0.08509 -0.08465,-0.04515 -0.137614,-0.08118 -0.160188,-0.108529 -0.01563,-0.01823 -0.02344,-0.03864 -0.02344,-0.06121 0,-0.02909 0.01215,-0.05557 0.0369,-0.07857 0.02475,-0.02257 0.056,-0.0343 0.09334,-0.0343 0.03343,0 0.06555,0.0087 0.09681,0.02561 0.03082,0.01693 0.05513,0.03994 0.07163,0.06902 0.01693,0.02865 0.02865,0.06772 0.03516,0.116342 h 0.01997 v -0.25439 z m 0.796163,0.0573 c 0.0382,0 0.06642,0.0035 0.08465,0.01041 0.01823,0.0074 0.03386,0.0191 0.04602,0.03516 0.01259,0.01606 0.02344,0.04124 0.03299,0.07554 h 0.0191 l -0.0069,-0.161489 h -0.547851 v 0.01997 h 0.02605 c 0.0178,0 0.0343,0.0043 0.04992,0.01302 0.01129,0.0065 0.01867,0.01433 0.02257,0.02344 0.0048,0.01172 0.0069,0.03646 0.0069,0.0738 v 0.475354 c 0,0.04428 -0.0043,0.07206 -0.01302,0.08335 -0.01389,0.0178 -0.03603,0.02692 -0.06642,0.02692 h -0.02605 v 0.01997 h 0.316035 v -0.01997 h -0.02648 c -0.01737,0 -0.0343,-0.0043 -0.04992,-0.01302 -0.01172,-0.0065 -0.01954,-0.01432 -0.02301,-0.02344 -0.0048,-0.01216 -0.0069,-0.03647 -0.0069,-0.0738 V 77.4848 h 0.134141 c 0.02431,0 0.04298,0.0035 0.05557,0.01041 0.01215,0.0065 0.02214,0.0165 0.02908,0.02995 0.0069,0.01346 0.01085,0.0343 0.01129,0.06295 h 0.01997 v -0.249181 h -0.01997 c -0.0048,0.04037 -0.01433,0.06729 -0.02865,0.08075 -0.01433,0.01346 -0.0369,0.0204 -0.06729,0.0204 h -0.134141 v -0.28912 z m 0.544813,0.67548 c -0.01736,0 -0.03386,-0.0043 -0.04949,-0.01302 -0.01172,-0.0065 -0.0191,-0.01432 -0.02301,-0.02344 -0.0043,-0.01216 -0.0069,-0.03647 -0.0069,-0.0738 V 77.24083 c 0,-0.04428 0.0043,-0.07206 0.01346,-0.08378 0.01389,-0.01736 0.0356,-0.02648 0.06599,-0.02648 h 0.02648 V 77.1106 h -0.315166 v 0.01997 h 0.02605 c 0.01736,0 0.03386,0.0043 0.04992,0.01302 0.01085,0.0065 0.01823,0.01433 0.02214,0.02344 0.0048,0.01172 0.0069,0.03646 0.0069,0.0738 v 0.475354 c 0,0.04428 -0.0043,0.07206 -0.01302,0.08335 -0.01389,0.0178 -0.0356,0.02692 -0.06598,0.02692 h -0.02605 v 0.01997 h 0.315166 v -0.01997 z m 0.03907,-0.695884 c 0.02127,0 0.0369,0.0017 0.04775,0.0048 0.02127,0.0069 0.03733,0.01433 0.04862,0.02258 0.01085,0.0078 0.02692,0.02431 0.04819,0.04905 v 0.511819 c 0,0.04124 -0.0039,0.06772 -0.01172,0.07944 -0.01302,0.01867 -0.03516,0.02822 -0.06685,0.02822 h -0.02561 v 0.01997 h 0.256127 v -0.01997 h -0.02605 c -0.02822,0 -0.04949,-0.0078 -0.06338,-0.02301 -0.0096,-0.01129 -0.01476,-0.0395 -0.01476,-0.08465 v -0.45278 l 0.485339,0.592565 h 0.01953 V 77.23825 c 0,-0.04124 0.0039,-0.06772 0.01172,-0.07944 0.01302,-0.01867 0.03516,-0.02822 0.06642,-0.02822 h 0.02605 V 77.1106 h -0.256127 v 0.01997 h 0.02561 c 0.02865,0 0.04992,0.0078 0.06338,0.02301 0.01,0.01129 0.01519,0.0395 0.01519,0.08465 v 0.424129 L 90.411977,77.1106 h -0.199692 z m 1.370061,0.5752 c 0.01433,0.0343 0.02171,0.05947 0.02171,0.07554 0,0.01216 -0.0052,0.02214 -0.01563,0.03039 -0.01,0.0082 -0.02995,0.01302 -0.05947,0.01476 v 0.01997 h 0.290422 v -0.01997 c -0.02995,-0.0022 -0.0534,-0.01041 -0.07033,-0.02474 -0.01693,-0.01476 -0.0356,-0.04688 -0.056,-0.09594 l -0.256127,-0.612099 h -0.0191 l -0.258731,0.605588 c -0.02257,0.0534 -0.04298,0.08856 -0.06121,0.105924 -0.0091,0.0087 -0.02909,0.01563 -0.05991,0.02127 v 0.01997 h 0.231817 v -0.01997 c -0.0356,-0.0026 -0.05861,-0.0082 -0.06946,-0.0165 -0.01042,-0.0087 -0.01563,-0.01867 -0.01563,-0.02952 0,-0.01433 0.0061,-0.0356 0.01823,-0.06425 l 0.04992,-0.116342 h 0.284778 z m -0.312561,-0.145862 0.128063,-0.297367 0.12459,0.297367 z m 0.547416,-0.429338 c 0.02127,0 0.03733,0.0017 0.04775,0.0048 0.02127,0.0069 0.03777,0.01433 0.04862,0.02258 0.01129,0.0078 0.02735,0.02431 0.04862,0.04905 v 0.511819 c 0,0.04124 -0.0039,0.06772 -0.01215,0.07944 -0.01302,0.01867 -0.03516,0.02822 -0.06642,0.02822 h -0.02561 v 0.01997 h 0.256127 v -0.01997 h -0.02605 c -0.02865,0 -0.04992,-0.0078 -0.06338,-0.02301 -0.01,-0.01129 -0.01476,-0.0395 -0.01476,-0.08465 v -0.45278 l 0.484904,0.592565 h 0.01954 V 77.23825 c 0,-0.04124 0.0043,-0.06772 0.01216,-0.07944 0.01302,-0.01867 0.03516,-0.02822 0.06599,-0.02822 h 0.02648 V 77.1106 h -0.256561 v 0.01997 h 0.02561 c 0.02909,0 0.05036,0.0078 0.06338,0.02301 0.01042,0.01129 0.01519,0.0395 0.01519,0.08465 v 0.424129 L 92.016893,77.1106 h -0.199692 z m 1.467303,-0.0369 c -0.0039,0.01736 -0.01042,0.03082 -0.01997,0.04081 -0.0074,0.0069 -0.01563,0.01041 -0.02561,0.01041 -0.0065,0 -0.01736,-0.0039 -0.03256,-0.01215 -0.05166,-0.02605 -0.104187,-0.03907 -0.157149,-0.03907 -0.06859,0 -0.131537,0.01693 -0.189274,0.05079 -0.05774,0.03386 -0.102884,0.08161 -0.135877,0.142823 -0.03299,0.06165 -0.04949,0.128932 -0.04949,0.202731 0,0.09116 0.02518,0.170173 0.0751,0.23746 0.06685,0.09073 0.161056,0.135877 0.283041,0.135877 0.06772,0 0.126327,-0.01519 0.175382,-0.04558 0.04905,-0.03039 0.09203,-0.07858 0.128932,-0.143692 l -0.0165,-0.01129 c -0.04385,0.06121 -0.08422,0.101582 -0.120684,0.121985 -0.03647,0.0204 -0.07857,0.03082 -0.126327,0.03082 -0.05513,0 -0.104187,-0.01302 -0.14673,-0.03907 -0.04298,-0.02605 -0.0751,-0.06381 -0.09637,-0.112435 -0.02127,-0.04905 -0.03212,-0.106358 -0.03212,-0.173211 0,-0.08075 0.01129,-0.148032 0.03386,-0.202296 0.02257,-0.05426 0.05383,-0.09377 0.09333,-0.118514 0.03907,-0.02474 0.08335,-0.03733 0.132405,-0.03733 0.05817,0 0.108094,0.0165 0.149769,0.04949 0.04167,0.03299 0.07336,0.08682 0.09594,0.16149 h 0.01693 l -0.01693,-0.25005 z m 0.525277,0.0573 c 0.03647,0 0.06208,0.0026 0.0764,0.0078 0.01823,0.0078 0.03169,0.01867 0.04124,0.03343 0.0091,0.01433 0.01736,0.04081 0.02518,0.07944 h 0.02127 l -0.0082,-0.161056 h -0.566952 v 0.01997 h 0.02605 c 0.03039,0 0.05209,0.0074 0.06512,0.02171 0.0091,0.01086 0.01389,0.03994 0.01389,0.08639 v 0.477959 c 0,0.03603 -0.0022,0.05947 -0.0061,0.0712 -0.0043,0.01172 -0.01215,0.0204 -0.02388,0.02605 -0.01519,0.0082 -0.03169,0.01259 -0.04905,0.01259 h -0.02605 v 0.01997 h 0.566951 l 0.06338,-0.184498 h -0.02171 c -0.02344,0.04515 -0.04645,0.07901 -0.06859,0.101583 -0.0178,0.01693 -0.0356,0.02822 -0.0547,0.03386 -0.01867,0.0061 -0.04905,0.0087 -0.09029,0.0087 h -0.125025 c -0.0204,0 -0.03386,-0.0017 -0.04124,-0.0061 -0.0074,-0.0043 -0.01216,-0.0095 -0.01519,-0.01693 -0.003,-0.0069 -0.0043,-0.02648 -0.0043,-0.05904 v -0.24267 h 0.161925 c 0.03082,0 0.0534,0.0035 0.06816,0.01086 0.01476,0.0069 0.02561,0.01693 0.03213,0.02952 0.0052,0.01041 0.01,0.03343 0.01519,0.06903 h 0.01997 v -0.256127 h -0.01997 c -0.0022,0.04211 -0.01259,0.0712 -0.03169,0.08813 -0.01389,0.01259 -0.04211,0.0191 -0.08378,0.0191 H 93.607995 V 77.15098 Z m 0.734086,-0.0573 c -0.0035,0.01693 -0.0082,0.02865 -0.01433,0.03386 -0.0061,0.0056 -0.01346,0.0087 -0.02301,0.0087 -0.0082,0 -0.02257,-0.0048 -0.04298,-0.01346 -0.04385,-0.01954 -0.08509,-0.02908 -0.124156,-0.02908 -0.06251,0 -0.114171,0.0191 -0.154544,0.0573 -0.04037,0.0382 -0.06078,0.08378 -0.06078,0.136311 0,0.03039 0.0069,0.05861 0.0204,0.08378 0.01389,0.02518 0.03386,0.04862 0.06078,0.06946 0.02648,0.02084 0.0712,0.04905 0.134141,0.08422 0.06295,0.0356 0.101583,0.0586 0.115474,0.06946 0.02127,0.01563 0.03647,0.03299 0.04645,0.05166 0.01,0.01823 0.01476,0.03647 0.01476,0.0547 0,0.03256 -0.01302,0.06078 -0.03907,0.08465 -0.02605,0.02388 -0.06208,0.0356 -0.107226,0.0356 -0.03907,0 -0.0751,-0.0087 -0.10766,-0.02605 -0.03299,-0.01736 -0.05687,-0.03907 -0.07293,-0.06512 -0.01606,-0.02648 -0.02865,-0.06599 -0.0382,-0.118947 h -0.01997 v 0.252653 h 0.01997 c 0.0026,-0.01693 0.0065,-0.02822 0.01172,-0.03386 0.0052,-0.0052 0.01259,-0.0078 0.02171,-0.0078 0.0091,0 0.03169,0.0056 0.06685,0.01693 0.03516,0.01129 0.05861,0.0178 0.06989,0.01997 0.01867,0.003 0.03864,0.0048 0.05991,0.0048 0.06816,0 0.123723,-0.0204 0.167134,-0.06077 0.04298,-0.04037 0.06468,-0.08813 0.06468,-0.144127 0,-0.02909 -0.0065,-0.0573 -0.0204,-0.08378 -0.01346,-0.02691 -0.03299,-0.05036 -0.05817,-0.06989 -0.02474,-0.01953 -0.07206,-0.04819 -0.140652,-0.08509 -0.08422,-0.04515 -0.137614,-0.08118 -0.160188,-0.108529 -0.01519,-0.01823 -0.02301,-0.03864 -0.02301,-0.06121 0,-0.02909 0.01215,-0.05557 0.0369,-0.07857 0.02431,-0.02257 0.05557,-0.0343 0.09333,-0.0343 0.03299,0 0.06512,0.0087 0.09637,0.02561 0.03126,0.01693 0.05513,0.03994 0.07206,0.06902 0.0165,0.02865 0.02822,0.06772 0.03473,0.116342 h 0.0204 v -0.25439 h -0.0204"
         style="fill:#211e1e;fill-opacity:1;fill-rule:nonzero;stroke:none;stroke-width:0.11113299"
         inkscape:connector-curvature="0" />
      <path
         id="path10241"
         d="m 86.021355,76.40169 c 0.143258,0 0.249616,-0.0382 0.319074,-0.115041 0.06251,-0.06859 0.09333,-0.154109 0.09333,-0.25656 0,-0.0764 -0.01736,-0.143692 -0.05209,-0.201863 -0.03516,-0.05817 -0.08118,-0.09985 -0.138483,-0.125025 -0.0573,-0.02474 -0.141086,-0.03733 -0.250917,-0.03733 h -0.299538 v 0.01997 h 0.02778 c 0.02778,0 0.04862,0.0078 0.06251,0.02388 0.01042,0.01172 0.01563,0.04037 0.01563,0.08639 v 0.475354 c 0,0.04167 -0.0043,0.06859 -0.01215,0.08031 -0.01302,0.01997 -0.03516,0.02995 -0.06598,0.02995 h -0.02778 v 0.01997 z m -0.118512,-0.678953 c 0.04124,-0.01041 0.07857,-0.01563 0.111133,-0.01563 0.08682,0 0.158017,0.02908 0.213149,0.08769 0.05557,0.05904 0.08292,0.138916 0.08292,0.2405 0,0.101147 -0.02735,0.181024 -0.08292,0.240064 -0.05513,0.05861 -0.125024,0.08813 -0.208808,0.08813 -0.03126,0 -0.06989,-0.0048 -0.115474,-0.01476 z m 1.007576,-0.01693 c 0.03647,0 0.06208,0.003 0.0764,0.0082 0.01823,0.0078 0.03169,0.01867 0.04081,0.03343 0.0096,0.01433 0.0178,0.04081 0.02561,0.07944 h 0.02084 l -0.0082,-0.161056 H 86.49888 v 0.01997 h 0.02605 c 0.03039,0 0.05209,0.0074 0.06512,0.02171 0.0096,0.01086 0.01433,0.03994 0.01433,0.08639 v 0.477959 c 0,0.03603 -0.0022,0.05947 -0.0065,0.07119 -0.0039,0.01172 -0.01172,0.0204 -0.02344,0.02605 -0.01563,0.0082 -0.03212,0.01259 -0.04949,0.01259 H 86.4989 v 0.01997 h 0.566952 l 0.06382,-0.184499 h -0.02171 c -0.02344,0.04515 -0.04645,0.07901 -0.06902,0.101583 -0.01736,0.01693 -0.0356,0.02822 -0.05426,0.03386 -0.01867,0.0061 -0.04905,0.0087 -0.09073,0.0087 h -0.124591 c -0.0204,0 -0.03386,-0.0017 -0.04124,-0.0061 -0.0074,-0.0043 -0.01216,-0.0095 -0.01519,-0.01693 -0.003,-0.0069 -0.0043,-0.02648 -0.0043,-0.05904 v -0.24267 h 0.161491 c 0.03082,0 0.05383,0.0035 0.06859,0.01086 0.01476,0.0069 0.02518,0.01693 0.03212,0.02952 0.0048,0.01041 0.01,0.03343 0.01519,0.06902 h 0.01997 v -0.256127 h -0.01997 c -0.0022,0.04211 -0.01302,0.07119 -0.03169,0.08812 -0.01389,0.01259 -0.04211,0.0191 -0.08422,0.0191 h -0.161491 v -0.291291 z m 1.103082,0.592565 c -0.01867,0.02127 -0.0395,0.0356 -0.06251,0.04428 -0.02257,0.0082 -0.06208,0.01216 -0.118513,0.01216 h -0.05383 c -0.04732,0 -0.07554,-0.0017 -0.08465,-0.0052 -0.0091,-0.0035 -0.01563,-0.0091 -0.01997,-0.01693 -0.0061,-0.01129 -0.0087,-0.03169 -0.0087,-0.06164 v -0.462331 c 0,-0.04385 0.0026,-0.07163 0.0087,-0.08335 0.0056,-0.01129 0.0165,-0.02084 0.03212,-0.02865 0.01563,-0.0074 0.04298,-0.01129 0.08205,-0.01086 v -0.01997 h -0.332964 v 0.01997 h 0.02735 c 0.02822,0 0.04905,0.0078 0.06338,0.02388 0.01,0.01172 0.01519,0.04037 0.01519,0.08639 v 0.47492 c 0,0.04167 -0.0039,0.06859 -0.01172,0.08031 -0.01302,0.01997 -0.0356,0.03039 -0.06685,0.03039 h -0.02735 v 0.01997 h 0.569556 l 0.06295,-0.199691 -0.0178,-0.0039 c -0.01867,0.04558 -0.03777,0.07901 -0.05643,0.100279 z m 0.218359,-0.425865 c 0.03213,-0.03516 0.04819,-0.0738 0.04819,-0.116342 0,-0.03082 -0.01,-0.056 -0.02909,-0.0764 -0.01954,-0.0204 -0.04124,-0.03082 -0.06555,-0.03082 -0.02084,0 -0.03907,0.0069 -0.05426,0.02084 -0.01085,0.01 -0.0165,0.02388 -0.0165,0.04211 0,0.0165 0.0056,0.02995 0.0165,0.04081 0.01129,0.01086 0.02431,0.01606 0.03864,0.01606 0.0061,0 0.01389,-0.0013 0.02344,-0.0048 0.0065,-0.0026 0.01172,-0.0039 0.01563,-0.0039 0.0052,0 0.0096,0.003 0.01433,0.0082 0.0039,0.0056 0.0056,0.01389 0.0056,0.02518 0,0.0191 -0.0048,0.0356 -0.01389,0.04905 -0.01346,0.01954 -0.03864,0.03994 -0.07597,0.06208 v 0.02561 c 0.04037,-0.01519 0.07119,-0.03429 0.0929,-0.05774 z m 0.582146,-0.1667 c 0.03646,0 0.06208,0.003 0.0764,0.0082 0.01823,0.0078 0.03169,0.01867 0.04081,0.03343 0.0095,0.01433 0.0178,0.04081 0.02561,0.07944 h 0.02084 l -0.0082,-0.161056 h -0.566952 v 0.01997 h 0.02605 c 0.03039,0 0.05209,0.0074 0.06512,0.02171 0.0096,0.01086 0.01433,0.03994 0.01433,0.08639 v 0.477959 c 0,0.03603 -0.0022,0.05947 -0.0065,0.07119 -0.0039,0.01172 -0.01172,0.0204 -0.02344,0.02605 -0.01563,0.0082 -0.03213,0.01259 -0.04949,0.01259 h -0.02605 v 0.01997 h 0.566952 l 0.06381,-0.184499 h -0.02171 c -0.02344,0.04515 -0.04645,0.07901 -0.06902,0.101583 -0.01736,0.01693 -0.0356,0.02822 -0.05426,0.03386 -0.01867,0.0061 -0.04905,0.0087 -0.09073,0.0087 h -0.124591 c -0.0204,0 -0.0343,-0.0017 -0.04124,-0.0061 -0.0074,-0.0043 -0.01215,-0.0095 -0.01519,-0.01693 -0.003,-0.0069 -0.0043,-0.02648 -0.0043,-0.05904 v -0.24267 h 0.16149 c 0.03082,0 0.05383,0.0035 0.06859,0.01086 0.01476,0.0069 0.02518,0.01693 0.03212,0.02952 0.0048,0.01041 0.01,0.03343 0.01519,0.06902 h 0.01997 v -0.256127 h -0.01997 c -0.0022,0.04211 -0.01302,0.07119 -0.03169,0.08812 -0.01433,0.01259 -0.04211,0.0191 -0.08422,0.0191 h -0.161491 v -0.291291 z m -0.0929,-0.279135 -0.05687,0.187104 h 0.01823 l 0.160187,-0.187104 z m 0.987607,0.222266 c -0.0039,0.01736 -0.01042,0.03082 -0.01997,0.04081 -0.0074,0.0069 -0.01563,0.01041 -0.02561,0.01041 -0.0065,0 -0.01736,-0.0039 -0.03256,-0.01215 -0.05166,-0.02605 -0.104187,-0.03907 -0.157149,-0.03907 -0.06859,0 -0.131536,0.01693 -0.189273,0.05079 -0.05774,0.03386 -0.102885,0.08161 -0.135878,0.142823 -0.03299,0.06164 -0.04949,0.128932 -0.04949,0.202731 0,0.09116 0.02518,0.170173 0.0751,0.23746 0.06685,0.09073 0.161056,0.135877 0.283042,0.135877 0.06772,0 0.126327,-0.01519 0.175381,-0.04558 0.04905,-0.03039 0.09203,-0.07857 0.128932,-0.143692 l -0.0165,-0.01129 c -0.04385,0.06121 -0.08422,0.101582 -0.120684,0.121985 -0.03646,0.0204 -0.07857,0.03082 -0.126327,0.03082 -0.05513,0 -0.104187,-0.01302 -0.14673,-0.03907 -0.04298,-0.02605 -0.0751,-0.06381 -0.09637,-0.112435 -0.02127,-0.04905 -0.03212,-0.106359 -0.03212,-0.173212 0,-0.08074 0.01129,-0.148032 0.03386,-0.202296 0.02257,-0.05426 0.05383,-0.09377 0.0929,-0.118514 0.0395,-0.02474 0.08378,-0.03733 0.132838,-0.03733 0.05817,0 0.108094,0.0165 0.149335,0.04949 0.04167,0.03299 0.0738,0.08682 0.09637,0.16149 h 0.01693 l -0.01693,-0.250049 z m 0.249615,0.09594 c -0.07944,0.0738 -0.119381,0.169304 -0.119381,0.286081 0,0.114606 0.03473,0.207506 0.103319,0.279569 0.06902,0.07206 0.154111,0.108094 0.255259,0.108094 0.10028,0 0.1858,-0.0369 0.256127,-0.110699 0.07076,-0.0738 0.105923,-0.166699 0.105923,-0.278267 0,-0.108961 -0.03516,-0.199257 -0.105055,-0.271754 -0.06989,-0.0725 -0.152808,-0.108963 -0.248313,-0.108963 -0.09594,0 -0.178855,0.03212 -0.247879,0.09594 z m 0.402858,0.01736 c 0.04949,0.06208 0.07423,0.155847 0.07423,0.281739 0,0.116343 -0.02257,0.200994 -0.06772,0.25526 -0.04471,0.05383 -0.102016,0.08074 -0.17104,0.08074 -0.06468,0 -0.116777,-0.02474 -0.156281,-0.0738 -0.05122,-0.06468 -0.07727,-0.157149 -0.07727,-0.277399 0,-0.117211 0.02474,-0.206204 0.07467,-0.266979 0.0395,-0.04862 0.09247,-0.07337 0.158452,-0.07337 0.06989,0 0.125024,0.02474 0.164963,0.0738 z m 0.226607,-0.0764 c 0.02127,0 0.03733,0.0017 0.04775,0.0048 0.02127,0.0069 0.03733,0.01433 0.04862,0.02258 0.01085,0.0078 0.02735,0.02431 0.04862,0.04905 v 0.51182 c 0,0.04124 -0.0039,0.06772 -0.01216,0.07944 -0.01302,0.01867 -0.03516,0.02822 -0.06642,0.02822 h -0.02561 v 0.01997 h 0.256127 v -0.01997 h -0.02605 c -0.02865,0 -0.04992,-0.0078 -0.06338,-0.02301 -0.01,-0.01129 -0.01476,-0.03951 -0.01476,-0.08465 v -0.452781 l 0.484904,0.592566 h 0.01954 V 75.7935 c 0,-0.04124 0.0039,-0.06772 0.01215,-0.07944 0.01302,-0.01867 0.03516,-0.02822 0.06598,-0.02822 h 0.02605 v -0.01997 h -0.256127 v 0.01997 h 0.02561 c 0.02908,0 0.04992,0.0078 0.06338,0.02301 0.01042,0.01129 0.01519,0.0395 0.01519,0.08465 v 0.424129 l -0.449741,-0.551757 h -0.199692 z m 0.975886,0.05904 c -0.07988,0.0738 -0.119381,0.169304 -0.119381,0.286081 0,0.114606 0.0343,0.207506 0.103319,0.279569 0.06859,0.07206 0.153676,0.108094 0.255259,0.108094 0.10028,0 0.185366,-0.0369 0.256126,-0.110699 0.07033,-0.0738 0.10549,-0.166699 0.10549,-0.278267 0,-0.108961 -0.03473,-0.199257 -0.104621,-0.271754 -0.06989,-0.0725 -0.152808,-0.108963 -0.248313,-0.108963 -0.09637,0 -0.178855,0.03212 -0.247879,0.09594 z m 0.402423,0.01736 c 0.04949,0.06208 0.07423,0.155847 0.07423,0.281739 0,0.116343 -0.02214,0.200994 -0.06729,0.25526 -0.04515,0.05383 -0.102451,0.08074 -0.171475,0.08074 -0.06468,0 -0.116776,-0.02474 -0.15628,-0.0738 -0.05123,-0.06468 -0.07684,-0.157149 -0.07684,-0.277399 0,-0.117211 0.02474,-0.206204 0.07423,-0.266979 0.03994,-0.04862 0.09247,-0.07337 0.158451,-0.07337 0.07033,0 0.125025,0.02474 0.164963,0.0738 z m 0.714117,0.639449 0.28391,-0.619045 v 0.491415 c 0,0.04124 -0.0039,0.06772 -0.01216,0.07944 -0.01259,0.01867 -0.03473,0.02822 -0.06598,0.02822 h -0.02605 v 0.01997 h 0.312562 v -0.01997 h -0.02561 c -0.02908,0 -0.04992,-0.0078 -0.06338,-0.02301 -0.01,-0.01129 -0.01519,-0.0395 -0.01519,-0.08465 v -0.480563 c 0,-0.04124 0.0039,-0.06772 0.01172,-0.07944 0.01302,-0.01867 0.0356,-0.02822 0.06685,-0.02822 h 0.02561 v -0.01997 h -0.208374 l -0.262639,0.575634 -0.26698,-0.575634 h -0.208374 v 0.01997 c 0.02995,0 0.05166,0.0035 0.06512,0.01086 0.01389,0.0069 0.02301,0.01563 0.02822,0.02605 0.0069,0.01476 0.01085,0.0382 0.01085,0.07076 v 0.480564 c 0,0.04124 -0.0039,0.06772 -0.01216,0.07944 -0.01302,0.01867 -0.03516,0.02822 -0.06598,0.02822 h -0.02605 v 0.01997 h 0.256127 v -0.01997 h -0.02605 c -0.02909,0 -0.05036,-0.0078 -0.06338,-0.02301 -0.01,-0.01129 -0.01476,-0.03951 -0.01476,-0.08465 v -0.491416 l 0.284344,0.619045 z m 0.83176,-0.01997 c -0.01736,0 -0.03386,-0.0043 -0.04905,-0.01302 -0.01172,-0.0065 -0.01954,-0.01433 -0.02301,-0.02344 -0.0048,-0.01215 -0.0069,-0.03647 -0.0069,-0.0738 v -0.475354 c 0,-0.04428 0.0043,-0.07206 0.01346,-0.08378 0.01389,-0.01736 0.0356,-0.02648 0.06555,-0.02648 h 0.02692 v -0.01997 h -0.3156 v 0.01997 h 0.02605 c 0.01736,0 0.0343,0.0043 0.04992,0.01302 0.01129,0.0065 0.01867,0.01433 0.02214,0.02344 0.0048,0.01172 0.0074,0.03647 0.0074,0.0738 v 0.475354 c 0,0.04428 -0.0043,0.07206 -0.01302,0.08335 -0.01389,0.0178 -0.03603,0.02691 -0.06642,0.02691 h -0.02605 v 0.01997 h 0.3156 v -0.01997 z m 0.487944,-0.675914 c 0.03647,0 0.06208,0.003 0.0764,0.0082 0.01823,0.0078 0.03169,0.01867 0.04124,0.03343 0.0091,0.01433 0.01736,0.04081 0.02518,0.07944 h 0.02127 l -0.0082,-0.161056 h -0.566951 v 0.01997 h 0.02605 c 0.03039,0 0.05209,0.0074 0.06512,0.02171 0.0091,0.01086 0.01389,0.03994 0.01389,0.08639 v 0.477959 c 0,0.03603 -0.0022,0.05947 -0.0061,0.07119 -0.0043,0.01172 -0.01215,0.0204 -0.02388,0.02605 -0.01519,0.0082 -0.03169,0.01259 -0.04906,0.01259 h -0.02605 v 0.01997 h 0.566951 l 0.06338,-0.184499 h -0.02171 c -0.02344,0.04515 -0.04645,0.07901 -0.06902,0.101583 -0.01736,0.01693 -0.03516,0.02822 -0.05426,0.03386 -0.01867,0.0061 -0.04905,0.0087 -0.09073,0.0087 h -0.12459 c -0.0204,0 -0.03386,-0.0017 -0.04124,-0.0061 -0.0074,-0.0043 -0.01215,-0.0095 -0.01519,-0.01693 -0.0026,-0.0069 -0.0043,-0.02648 -0.0043,-0.05904 v -0.24267 h 0.161925 c 0.03039,0 0.0534,0.0035 0.06815,0.01086 0.01476,0.0069 0.02561,0.01693 0.03213,0.02952 0.0052,0.01041 0.01,0.03343 0.01519,0.06902 h 0.01997 v -0.256127 h -0.01997 c -0.0022,0.04211 -0.01259,0.07119 -0.03169,0.08812 -0.01389,0.01259 -0.04211,0.0191 -0.08378,0.0191 H 93.79806 v -0.291291 h 0.201863"
         style="fill:#211e1e;fill-opacity:1;fill-rule:nonzero;stroke:none;stroke-width:0.11113299"
         inkscape:connector-curvature="0" />
      <path
         id="path10243"
         d="m 87.468255,74.956961 0.28391,-0.619045 v 0.491415 c 0,0.04124 -0.0039,0.06772 -0.01172,0.07944 -0.01302,0.01867 -0.03473,0.02822 -0.06642,0.02822 h -0.02605 v 0.01997 h 0.312561 v -0.01997 h -0.02561 c -0.02865,0 -0.04992,-0.0078 -0.06338,-0.02301 -0.01,-0.01129 -0.01519,-0.03951 -0.01519,-0.08465 v -0.480563 c 0,-0.04124 0.0039,-0.06772 0.01215,-0.07944 0.01302,-0.01867 0.03516,-0.02822 0.06642,-0.02822 h 0.02561 v -0.01997 h -0.208374 l -0.262638,0.575634 -0.26698,-0.575634 h -0.208375 v 0.01997 c 0.02995,0 0.05166,0.0035 0.06555,0.01086 0.01346,0.0069 0.02257,0.01563 0.02778,0.02605 0.0074,0.01476 0.01085,0.0382 0.01085,0.07076 v 0.480564 c 0,0.04124 -0.0039,0.06772 -0.01172,0.07944 -0.01302,0.01867 -0.03516,0.02822 -0.06642,0.02822 h -0.02605 v 0.01997 H 87.2703 v -0.01997 h -0.02605 c -0.02865,0 -0.04992,-0.0078 -0.06338,-0.02301 -0.01,-0.01129 -0.01476,-0.0395 -0.01476,-0.08465 V 74.33792 l 0.284344,0.619045 z m 0.832195,-0.01997 c -0.01736,0 -0.03386,-0.0043 -0.04949,-0.01302 -0.01172,-0.0065 -0.0191,-0.01433 -0.02301,-0.02344 -0.0043,-0.01215 -0.0069,-0.03647 -0.0069,-0.0738 v -0.475354 c 0,-0.04428 0.0048,-0.07206 0.01389,-0.08378 0.01346,-0.01736 0.03516,-0.02648 0.06555,-0.02648 h 0.02648 v -0.01997 h -0.315166 v 0.01997 h 0.02605 c 0.01736,0 0.03386,0.0043 0.04992,0.01302 0.01085,0.0065 0.01867,0.01433 0.02214,0.02344 0.0048,0.01172 0.0069,0.03646 0.0069,0.0738 v 0.475354 c 0,0.04428 -0.0043,0.07206 -0.01302,0.08335 -0.01346,0.0178 -0.0356,0.02691 -0.06599,0.02691 h -0.02605 v 0.01997 h 0.315166 v -0.01997 z m 0.03907,-0.695883 c 0.02127,0 0.0369,0.0017 0.04775,0.0048 0.02127,0.0069 0.03733,0.01433 0.04862,0.02258 0.01085,0.0078 0.02692,0.02431 0.04862,0.04905 v 0.51182 c 0,0.04124 -0.0043,0.06772 -0.01216,0.07944 -0.01302,0.01867 -0.03516,0.02822 -0.06685,0.02822 h -0.02561 v 0.01997 h 0.256127 v -0.01997 h -0.02561 c -0.02865,0 -0.04992,-0.0078 -0.06381,-0.02301 -0.0096,-0.01129 -0.01476,-0.03951 -0.01476,-0.08465 v -0.452781 l 0.485339,0.592566 h 0.01953 v -0.620349 c 0,-0.04124 0.0039,-0.06772 0.01216,-0.07944 0.01259,-0.01867 0.03473,-0.02822 0.06598,-0.02822 h 0.02605 v -0.01997 h -0.256127 v 0.01997 h 0.02561 c 0.02865,0 0.04992,0.0078 0.06338,0.02301 0.01,0.01129 0.01519,0.0395 0.01519,0.08465 V 74.7729 L 88.539212,74.221139 H 88.33952 Z m 1.13347,0.695883 c -0.01736,0 -0.03386,-0.0043 -0.04949,-0.01302 -0.01129,-0.0065 -0.0191,-0.01433 -0.02257,-0.02344 -0.0048,-0.01215 -0.0074,-0.03647 -0.0074,-0.0738 v -0.475354 c 0,-0.04428 0.0048,-0.07206 0.01389,-0.08378 0.01346,-0.01736 0.0356,-0.02648 0.06555,-0.02648 h 0.02648 v -0.01997 h -0.315166 v 0.01997 h 0.02605 c 0.01736,0 0.03386,0.0043 0.04992,0.01302 0.01129,0.0065 0.01867,0.01433 0.02214,0.02344 0.0048,0.01172 0.0074,0.03646 0.0074,0.0738 v 0.475354 c 0,0.04428 -0.0043,0.07206 -0.01302,0.08335 -0.01389,0.0178 -0.03603,0.02691 -0.06642,0.02691 h -0.02605 v 0.01997 h 0.315166 v -0.01997 z m 0.543076,-0.732782 c -0.0035,0.01693 -0.0082,0.02865 -0.01433,0.03386 -0.0061,0.0056 -0.01346,0.0087 -0.02301,0.0087 -0.0082,0 -0.02257,-0.0048 -0.04298,-0.01346 -0.04385,-0.01953 -0.08509,-0.02908 -0.124157,-0.02908 -0.06251,0 -0.114172,0.0191 -0.154544,0.0573 -0.04081,0.0382 -0.06078,0.08378 -0.06078,0.136311 0,0.03039 0.0065,0.05861 0.0204,0.08378 0.01389,0.02518 0.03386,0.04862 0.06034,0.06946 0.02691,0.02084 0.07163,0.04906 0.134575,0.08422 0.06295,0.0356 0.101583,0.05861 0.115474,0.06946 0.02127,0.01563 0.03647,0.03299 0.04645,0.05166 0.01,0.01823 0.01476,0.03647 0.01476,0.0547 0,0.03256 -0.01302,0.06078 -0.03907,0.08465 -0.02648,0.02388 -0.06208,0.0356 -0.107226,0.0356 -0.03907,0 -0.0751,-0.0087 -0.10766,-0.02605 -0.03256,-0.01737 -0.0573,-0.03907 -0.07293,-0.06512 -0.01606,-0.02648 -0.02865,-0.06599 -0.0382,-0.118947 h -0.01997 v 0.252653 h 0.01997 c 0.0026,-0.01693 0.0065,-0.02822 0.01172,-0.03386 0.0052,-0.0052 0.01259,-0.0078 0.02171,-0.0078 0.0091,0 0.03169,0.0056 0.06685,0.01693 0.03516,0.01129 0.05861,0.0178 0.06946,0.01997 0.0191,0.003 0.03907,0.0048 0.06034,0.0048 0.06816,0 0.123722,-0.0204 0.1667,-0.06078 0.04341,-0.04037 0.06512,-0.08813 0.06512,-0.144126 0,-0.02908 -0.0069,-0.0573 -0.0204,-0.08378 -0.01346,-0.02692 -0.03299,-0.05036 -0.05817,-0.06989 -0.02518,-0.01953 -0.07206,-0.04819 -0.140653,-0.08508 -0.08422,-0.04515 -0.137614,-0.08118 -0.160187,-0.10853 -0.01563,-0.01823 -0.02344,-0.03863 -0.02344,-0.06121 0,-0.02909 0.01259,-0.05557 0.0369,-0.07858 0.02474,-0.02257 0.056,-0.03429 0.09377,-0.03429 0.03299,0 0.06512,0.0087 0.09637,0.02561 0.03126,0.01693 0.05513,0.03994 0.07206,0.06902 0.0165,0.02865 0.02822,0.06772 0.03473,0.116343 h 0.01997 v -0.254391 z m 0.17104,0.01693 -0.0087,0.172343 h 0.0204 c 0.0026,-0.03299 0.01085,-0.05947 0.02388,-0.07901 0.01346,-0.01954 0.02952,-0.03299 0.04862,-0.0395 0.01432,-0.0052 0.03864,-0.0078 0.07293,-0.0078 h 0.08856 v 0.562176 c 0,0.04124 -0.0039,0.06772 -0.01172,0.07944 -0.01302,0.01867 -0.03516,0.02822 -0.06642,0.02822 h -0.02605 v 0.01997 h 0.312127 v -0.01997 h -0.02561 c -0.02865,0 -0.04949,-0.0078 -0.06338,-0.02301 -0.01,-0.01129 -0.01476,-0.0395 -0.01476,-0.08465 v -0.562176 h 0.103753 c 0.03039,0 0.0547,0.0052 0.07336,0.01476 0.01867,0.01 0.03343,0.02561 0.04471,0.04645 0.0069,0.01302 0.01259,0.03473 0.0165,0.06512 h 0.0204 l -0.0078,-0.172343 z m 1.070523,0.03994 c 0.03647,0 0.06208,0.003 0.0764,0.0082 0.01823,0.0078 0.03212,0.01867 0.04124,0.03343 0.0091,0.01433 0.0178,0.04081 0.02518,0.07944 h 0.02127 l -0.0082,-0.161056 h -0.566952 v 0.01997 h 0.02605 c 0.03039,0 0.05209,0.0074 0.06512,0.02171 0.0091,0.01086 0.01389,0.03994 0.01389,0.08639 v 0.477959 c 0,0.03603 -0.0022,0.05947 -0.0061,0.0712 -0.0043,0.01172 -0.01216,0.0204 -0.02388,0.02605 -0.01519,0.0082 -0.03169,0.01259 -0.04905,0.01259 h -0.02605 v 0.01997 h 0.566952 l 0.06338,-0.184499 h -0.02171 c -0.02344,0.04515 -0.04645,0.07901 -0.06902,0.101583 -0.01693,0.01693 -0.03516,0.02822 -0.05383,0.03386 -0.0191,0.0061 -0.04905,0.0087 -0.09073,0.0087 h -0.125025 c -0.01997,0 -0.03386,-0.0017 -0.04124,-0.0061 -0.0069,-0.0043 -0.01215,-0.0095 -0.01519,-0.01693 -0.003,-0.0069 -0.0043,-0.02648 -0.0043,-0.05904 v -0.24267 h 0.161924 c 0.03082,0 0.0534,0.0035 0.06816,0.01086 0.01476,0.0069 0.02561,0.01693 0.03212,0.02952 0.0052,0.01041 0.01,0.03343 0.01519,0.06902 h 0.01997 v -0.256127 h -0.01997 c -0.0022,0.04211 -0.01259,0.0712 -0.03169,0.08813 -0.01389,0.01259 -0.04211,0.0191 -0.08378,0.0191 h -0.161924 v -0.291291 z m -0.05426,-0.09203 h 0.0191 l -0.0573,-0.187102 h -0.121117 z m 1.05012,0.767946 c -0.04037,-0.0043 -0.07293,-0.01476 -0.09767,-0.03039 -0.02518,-0.01606 -0.0547,-0.04819 -0.08943,-0.09681 L 91.91445,74.598816 c 0.06164,-0.01389 0.10766,-0.03733 0.136745,-0.07076 0.02952,-0.03299 0.04428,-0.0725 0.04428,-0.117646 0,-0.04211 -0.01302,-0.07857 -0.03864,-0.109396 -0.02605,-0.03039 -0.0573,-0.05123 -0.09464,-0.06295 -0.0369,-0.01129 -0.09464,-0.01693 -0.172777,-0.01693 H 91.52157 v 0.01997 h 0.02778 c 0.02778,0 0.04862,0.0078 0.06251,0.02388 0.01042,0.01129 0.01519,0.03994 0.01519,0.08639 v 0.475354 c 0,0.04211 -0.0035,0.06859 -0.01129,0.07988 -0.01346,0.01997 -0.0356,0.03039 -0.06642,0.03039 h -0.02778 v 0.01997 h 0.315166 v -0.01997 h -0.02865 c -0.02778,0 -0.04819,-0.0082 -0.06208,-0.02388 -0.01,-0.01129 -0.01519,-0.03994 -0.01519,-0.08639 v -0.213584 c 0.0061,0 0.01129,4.45e-4 0.01693,4.45e-4 0.0056,4.44e-4 0.01042,4.44e-4 0.01519,4.44e-4 0.01172,0 0.02648,-4.44e-4 0.04515,-8.89e-4 l 0.248747,0.343818 h 0.196653 z m -0.522672,-0.664193 c 0.03603,-0.0069 0.06425,-0.01041 0.08509,-0.01041 0.04775,0 0.08552,0.01433 0.114606,0.04298 0.02865,0.02908 0.04298,0.06642 0.04298,0.112435 0,0.04688 -0.0178,0.08552 -0.0534,0.115908 -0.0356,0.03039 -0.08856,0.04558 -0.158885,0.04558 -0.003,0 -0.0074,0 -0.01215,-4.45e-4 -0.0052,0 -0.01129,0 -0.01823,0 z m 0.946801,-0.01172 c 0.0369,0 0.06208,0.003 0.07684,0.0082 0.0178,0.0078 0.03169,0.01867 0.04081,0.03343 0.0091,0.01433 0.0178,0.04081 0.02518,0.07944 h 0.02127 l -0.0082,-0.161056 h -0.566951 v 0.01997 h 0.02605 c 0.03039,0 0.05209,0.0074 0.06512,0.02171 0.0096,0.01086 0.01389,0.03994 0.01389,0.08639 v 0.477959 c 0,0.03603 -0.0017,0.05947 -0.0061,0.0712 -0.0043,0.01172 -0.01216,0.0204 -0.02344,0.02605 -0.01563,0.0082 -0.03212,0.01259 -0.04949,0.01259 h -0.02605 v 0.01997 h 0.566952 l 0.06381,-0.184499 h -0.02214 c -0.02344,0.04515 -0.04645,0.07901 -0.06859,0.101583 -0.01736,0.01693 -0.0356,0.02822 -0.05426,0.03386 -0.0191,0.0061 -0.04905,0.0087 -0.09073,0.0087 h -0.125024 c -0.01997,0 -0.03386,-0.0017 -0.04124,-0.0061 -0.0069,-0.0043 -0.01215,-0.0095 -0.01476,-0.01693 -0.003,-0.0069 -0.0043,-0.02648 -0.0043,-0.05904 v -0.24267 h 0.16149 c 0.03082,0 0.0534,0.0035 0.06816,0.01086 0.01519,0.0069 0.02561,0.01693 0.03212,0.02952 0.0052,0.01041 0.01,0.03343 0.01519,0.06902 h 0.01997 v -0.256127 h -0.01997 c -0.0022,0.04211 -0.01259,0.0712 -0.03126,0.08813 -0.01432,0.01259 -0.04211,0.0191 -0.08422,0.0191 h -0.16149 v -0.291291 h 0.201429"
         style="fill:#211e1e;fill-opacity:1;fill-rule:nonzero;stroke:none;stroke-width:0.11113299"
         inkscape:connector-curvature="0" />
      <path
         id="path10245"
         d="m 85.735709,70.114428 c -0.03473,0 -0.0547,-0.0043 -0.07467,-0.0178 -0.03082,-0.0204 -0.06381,-0.07684 -0.08292,-0.108962 -0.03169,-0.05557 -0.06729,-0.11504 -0.101583,-0.164529 -0.0056,8.67e-4 -0.01,8.67e-4 -0.01389,8.67e-4 -0.0096,0 -0.01693,-8.67e-4 -0.02648,-8.67e-4 v 0.04949 c 0,0.02561 8.67e-4,0.05079 8.67e-4,0.0764 0.0013,0.05079 0.0022,0.0725 0.0096,0.09203 0.0096,0.02474 0.02648,0.0369 0.05774,0.0395 v 0.02648 l -0.02214,-8.67e-4 c -0.02431,-8.67e-4 -0.05817,0 -0.102451,0 -0.04298,0 -0.07684,-8.67e-4 -0.101583,0 l -0.02257,8.67e-4 v -0.02648 c 0.02344,-0.0017 0.03516,-0.0065 0.04645,-0.01867 0.01,-0.01215 0.0165,-0.02909 0.01867,-0.05079 0.0026,-0.02822 0.0035,-0.04515 0.0035,-0.138482 v -0.158018 c 0,-0.114606 -0.0035,-0.142823 -0.01,-0.169304 -0.0069,-0.02518 -0.02648,-0.0356 -0.05861,-0.0395 v -0.02648 c 0.01867,0.0022 0.03777,0.0013 0.05644,0.0013 0.04905,0 0.06381,0 0.12242,-0.003 0.05079,-0.0017 0.07988,-0.0026 0.10245,-0.0026 0.06425,0 0.102885,0.0091 0.134576,0.03169 0.03603,0.02561 0.05947,0.07467 0.05947,0.123723 0,0.07684 -0.05079,0.139784 -0.137614,0.171909 0.03603,0.04515 0.06425,0.09029 0.09681,0.141955 0.03039,0.04819 0.06034,0.08943 0.08378,0.112869 0.01346,0.01433 0.02171,0.0191 0.03951,0.02344 v 0.02648 c -0.02431,0.0056 -0.04862,0.0074 -0.07771,0.0074 z M 85.493908,69.52577 c -0.0191,0 -0.03603,0.0026 -0.05687,0.0074 0,0.05557 -8.67e-4,0.156281 -8.67e-4,0.234422 0.01042,0.0017 0.02909,0.0026 0.04167,0.0026 0.07684,0 0.128498,-0.04775 0.128498,-0.121118 0,-0.07163 -0.04775,-0.123288 -0.112436,-0.123288"
         style="fill:#211e1e;fill-opacity:1;fill-rule:nonzero;stroke:none;stroke-width:0.11113299"
         inkscape:connector-curvature="0" />
      <path
         id="path10247"
         d="m 86.044798,69.538359 -0.03647,-0.0217 0.07684,-0.113738 0.08943,0.0165 z m 0.173211,0.556968 c -0.0069,0.01172 -0.01476,0.01432 -0.0573,0.01432 -0.02648,0 -0.05209,-0.0017 -0.07858,-0.0026 -0.03733,-8.67e-4 -0.07467,-0.0022 -0.112001,-0.0022 -0.0369,0 -0.07467,4.33e-4 -0.111567,0.0022 v -0.02171 c 0.03473,-0.003 0.05036,-0.02344 0.0534,-0.0573 0.0026,-0.02344 0.0026,-0.04819 0.0026,-0.08899 v -0.219662 c 0,-0.04124 -0.0026,-0.05991 -0.0087,-0.0764 -0.0069,-0.01997 -0.02127,-0.02952 -0.04732,-0.03256 v -0.02171 h 0.363353 c 0,0.02257 -4.34e-4,0.04602 -4.34e-4,0.06816 0,0.01867 -8.67e-4,0.0369 4.34e-4,0.05557 h -0.02778 c -0.0052,-0.05991 -0.03126,-0.0764 -0.123722,-0.0764 -0.01693,0 -0.0395,8.67e-4 -0.05817,0.0017 -0.0017,0.03039 -0.0022,0.04037 -0.0022,0.08552 v 0.08986 c 0.01129,8.67e-4 0.02084,8.67e-4 0.03473,8.67e-4 0.08074,0 0.105924,-0.01172 0.110699,-0.0534 h 0.02778 c -0.0017,0.01216 -0.0017,0.0382 -0.0017,0.07684 0,0.0395 8.67e-4,0.06295 0.0017,0.07554 h -0.02778 c -0.0026,-0.04428 -0.02344,-0.05513 -0.103753,-0.05513 -0.01389,0 -0.02778,4.33e-4 -0.04167,4.33e-4 0,0.04905 4.34e-4,0.09811 4.34e-4,0.147165 0,0.03256 0.0056,0.04341 0.02431,0.04819 0.01172,0.003 0.02952,0.0039 0.05383,0.0039 0.08378,0 0.113304,-0.01867 0.131102,-0.08248 l 0.03039,0.0061 c -0.01085,0.0547 -0.02344,0.09941 -0.03212,0.114172"
         style="fill:#211e1e;fill-opacity:1;fill-rule:nonzero;stroke:none;stroke-width:0.11113299"
         inkscape:connector-curvature="0" />
      <path
         id="path10249"
         d="m 86.542291,69.876099 c -0.0078,0 -0.01172,0 -0.02171,-4.33e-4 l -0.01736,-0.03994 c 0.07337,-0.0043 0.113738,-0.04037 0.113738,-0.09941 0,-0.06208 -0.04298,-0.106358 -0.102017,-0.106358 -0.0091,0 -0.01693,8.67e-4 -0.02952,0.003 0,0.04819 -0.0013,0.09637 -0.0013,0.14456 v 0.136312 c 0,0.101582 4.33e-4,0.118512 0.0087,0.138916 0.0065,0.01997 0.0204,0.03039 0.04732,0.03256 v 0.02171 l -0.01867,-8.67e-4 c -0.0204,-8.67e-4 -0.04819,-8.67e-4 -0.08552,-8.67e-4 -0.0369,0 -0.06555,0 -0.08509,8.67e-4 l -0.01823,8.67e-4 v -0.02171 c 0.03473,-0.003 0.05036,-0.02344 0.0534,-0.0573 0.0022,-0.02344 0.0022,-0.03777 0.0022,-0.114171 v -0.194483 c 0,-0.04124 -0.0022,-0.05991 -0.0082,-0.0764 -0.0069,-0.01997 -0.02127,-0.02952 -0.04732,-0.03256 v -0.0217 c 0.0091,8.67e-4 0.0022,8.67e-4 0.0356,8.67e-4 0.01346,0 0.03212,0 0.05687,-8.67e-4 0.0395,-0.0017 0.07901,-0.0039 0.118947,-0.0039 0.110265,0 0.17625,0.05426 0.17625,0.14456 0,0.08465 -0.07554,0.14673 -0.177987,0.14673"
         style="fill:#211e1e;fill-opacity:1;fill-rule:nonzero;stroke:none;stroke-width:0.11113299"
         inkscape:connector-curvature="0" />
      <path
         id="path10251"
         d="m 87.248594,69.627353 c -0.0087,0.01172 -0.01259,0.02735 -0.01389,0.05861 -0.0017,0.03343 -0.0026,0.05904 -0.0026,0.107226 0,0.0178 8.67e-4,0.07119 8.67e-4,0.125024 0,0.05426 -0.0082,0.08726 -0.03082,0.119816 -0.03603,0.05209 -0.09507,0.07814 -0.172777,0.07814 -0.04905,0 -0.08639,-0.0091 -0.121118,-0.03256 -0.05426,-0.03473 -0.07554,-0.08075 -0.07554,-0.163227 0,-0.08378 0.0017,-0.120249 0.0017,-0.147598 0,-0.0395 0.0022,-0.08075 -0.0048,-0.119816 -0.0048,-0.02778 -0.01954,-0.0395 -0.05209,-0.04254 v -0.0217 l 0.0178,8.66e-4 c 0.0204,4.34e-4 0.04905,4.34e-4 0.08639,4.34e-4 0.03733,0 0.06598,0 0.08639,-4.34e-4 l 0.0178,-8.66e-4 v 0.0217 c -0.02388,0.003 -0.03603,0.0091 -0.04341,0.02257 -0.0074,0.01172 -0.01042,0.02735 -0.01129,0.06164 -0.0013,0.04862 -0.0022,0.09681 -0.0022,0.145862 0,0.133707 0.003,0.15932 0.02735,0.187537 0.01867,0.02171 0.05036,0.03647 0.08813,0.03647 0.05166,0 0.102017,-0.02648 0.117645,-0.07858 0.01,-0.03343 0.01172,-0.05774 0.01172,-0.145428 v -0.07684 c 0,-0.08856 -0.0022,-0.115908 -0.01085,-0.128931 -0.0087,-0.01433 -0.0204,-0.02214 -0.04037,-0.02431 v -0.0217 c 0.03082,0.0013 0.04211,0.0013 0.08075,0.0013 0.0395,0 0.05036,0 0.08161,-0.0013 v 0.0217 c -0.01693,0.0022 -0.02778,0.0069 -0.03646,0.01693"
         style="fill:#211e1e;fill-opacity:1;fill-rule:nonzero;stroke:none;stroke-width:0.11113299"
         inkscape:connector-curvature="0" />
      <path
         id="path10253"
         d="m 87.726552,70.070582 c -0.03646,0.02778 -0.07771,0.03733 -0.157149,0.03733 -0.04167,0 -0.08465,-0.003 -0.126761,-0.003 -0.01693,0 -0.04862,0 -0.07076,0.0013 l -0.0091,8.67e-4 v -0.02171 c 0.03647,-0.003 0.05079,-0.0217 0.05383,-0.0573 0.0022,-0.02344 0.003,-0.03777 0.003,-0.114171 v -0.147165 c 0,-0.07206 -8.67e-4,-0.103319 -0.0087,-0.123722 -0.0078,-0.01997 -0.0217,-0.02952 -0.04819,-0.03256 v -0.0217 c 0.03603,0.0017 0.05687,0.0017 0.106357,0.0017 0.04515,0 0.11287,-0.0026 0.158018,-0.0026 0.07163,0 0.136745,0.0343 0.136745,0.11504 0,0.05991 -0.03733,0.10028 -0.111133,0.118947 0.08248,0.0165 0.125893,0.06382 0.125893,0.140653 0,0.04645 -0.01693,0.08161 -0.05209,0.108094 z m -0.169304,-0.441493 c -0.01433,0 -0.02822,0.0017 -0.04211,0.0017 -8.67e-4,0.05036 -0.0022,0.13718 -0.003,0.170172 0.0087,8.67e-4 0.01954,0.0013 0.0343,0.0013 0.07597,0 0.119381,-0.03169 0.119381,-0.08769 0,-0.05383 -0.04037,-0.08552 -0.108528,-0.08552 z m 0.0022,0.217057 c -0.01302,0 -0.02735,4.33e-4 -0.04732,0.0022 -8.68e-4,0.02084 -8.68e-4,0.02475 -8.68e-4,0.06078 v 0.04558 c 0,0.04385 0.0017,0.06685 0.0069,0.08248 0.0065,0.01954 0.02474,0.02865 0.05774,0.02865 0.06599,0 0.103319,-0.03647 0.103319,-0.101582 0,-0.0725 -0.04688,-0.118079 -0.119815,-0.118079"
         style="fill:#211e1e;fill-opacity:1;fill-rule:nonzero;stroke:none;stroke-width:0.11113299"
         inkscape:connector-curvature="0" />
      <path
         id="path10255"
         d="m 88.217534,70.096195 c -0.0069,0.01085 -0.01606,0.01302 -0.05513,0.01302 -0.01954,0 -0.0395,-4.33e-4 -0.05904,-0.0013 -0.04819,-0.0017 -0.0916,-0.003 -0.14456,-0.003 -0.03994,0 -0.06598,4.34e-4 -0.09073,0.0022 v -0.02171 c 0.0191,-0.0017 0.02909,-0.0056 0.03777,-0.01563 0.01389,-0.01606 0.0178,-0.03647 0.0178,-0.09333 0,-0.03864 8.67e-4,-0.06989 8.67e-4,-0.110265 v -0.08292 c 0,-0.105055 -8.67e-4,-0.118947 -0.0087,-0.140218 -0.0069,-0.01997 -0.02171,-0.02952 -0.04775,-0.03256 v -0.0217 l 0.0191,8.67e-4 c 0.02084,4.33e-4 0.04992,4.33e-4 0.08856,4.33e-4 0.0382,0 0.06772,0 0.08769,-4.33e-4 l 0.01953,-8.67e-4 v 0.0217 c -0.0395,0 -0.05643,0.02084 -0.06121,0.05817 -0.0017,0.01346 -0.0026,0.02605 -0.0026,0.114605 v 0.1298 c 0,0.10766 8.67e-4,0.121118 0.01085,0.131971 0.0087,0.0087 0.02518,0.01259 0.05817,0.01259 0.04298,0 0.06642,-0.0048 0.08595,-0.01563 0.02171,-0.01172 0.0382,-0.03516 0.04558,-0.06772 l 0.02952,0.0078 c -0.0082,0.04515 -0.02301,0.101148 -0.03169,0.114172"
         style="fill:#211e1e;fill-opacity:1;fill-rule:nonzero;stroke:none;stroke-width:0.11113299"
         inkscape:connector-curvature="0" />
      <path
         id="path10257"
         d="m 88.487987,70.10618 c -0.01954,-8.67e-4 -0.04819,-8.67e-4 -0.08465,-8.67e-4 -0.03733,0 -0.06555,0 -0.08552,8.67e-4 l -0.01867,8.66e-4 v -0.0217 c 0.03646,-0.003 0.05036,-0.02171 0.0534,-0.0573 0.0026,-0.02344 0.003,-0.03777 0.003,-0.114172 v -0.130668 c 0,-0.0204 -4.33e-4,-0.04124 -4.33e-4,-0.06382 0,-0.04124 -0.0017,-0.05991 -0.0078,-0.0764 -0.0069,-0.01997 -0.02171,-0.02952 -0.04819,-0.03256 v -0.02171 l 0.01867,8.67e-4 c 0.01997,4.33e-4 0.04819,4.33e-4 0.08552,4.33e-4 0.03647,0 0.06512,0 0.08465,-4.33e-4 l 0.01867,-8.67e-4 v 0.02171 c -0.03343,0.0026 -0.05079,0.02344 -0.05383,0.05817 -0.0022,0.02257 -0.0022,0.04471 -0.0022,0.114606 v 0.130668 c 0,0.101583 8.67e-4,0.118513 0.0082,0.138917 0.0074,0.01997 0.02127,0.03039 0.04775,0.03256 v 0.02171 l -0.01867,-8.67e-4"
         style="fill:#211e1e;fill-opacity:1;fill-rule:nonzero;stroke:none;stroke-width:0.11113299"
         inkscape:connector-curvature="0" />
      <path
         id="path10259"
         d="m 89.214258,70.247266 c -0.06034,0 -0.125024,-0.01867 -0.186234,-0.05296 -0.03516,-0.01954 -0.08378,-0.05296 -0.119815,-0.08248 -0.02648,0.0039 -0.03647,0.0048 -0.06121,0.0048 -0.157149,0 -0.261337,-0.102885 -0.261337,-0.257429 0,-0.165397 0.11287,-0.279569 0.277399,-0.279569 0.160188,0 0.266545,0.102451 0.266545,0.256127 0,0.109831 -0.05557,0.207072 -0.144559,0.251786 0.02822,0.01432 0.056,0.02995 0.08335,0.04602 0.07901,0.04819 0.133707,0.06859 0.184933,0.06859 0.03212,0 0.05817,-0.0074 0.08943,-0.02257 l 0.01,0.02692 c -0.0382,0.02648 -0.08552,0.04081 -0.138482,0.04081 z m -0.366391,-0.615138 c -0.09507,0 -0.162793,0.07944 -0.162793,0.190576 0,0.135009 0.08031,0.241801 0.181894,0.241801 0.09594,0 0.163226,-0.08074 0.163226,-0.193615 0,-0.133707 -0.07988,-0.238762 -0.182327,-0.238762"
         style="fill:#211e1e;fill-opacity:1;fill-rule:nonzero;stroke:none;stroke-width:0.11113299"
         inkscape:connector-curvature="0" />
      <path
         id="path10261"
         d="m 89.668341,69.627353 c -0.0087,0.01172 -0.01259,0.02735 -0.01389,0.05861 -0.0017,0.03343 -0.0026,0.05904 -0.0026,0.107226 0,0.0178 8.67e-4,0.07119 8.67e-4,0.125024 0,0.05426 -0.0087,0.08726 -0.03126,0.119816 -0.0356,0.05209 -0.09464,0.07814 -0.172343,0.07814 -0.04905,0 -0.08639,-0.0091 -0.121118,-0.03256 -0.0547,-0.03473 -0.07554,-0.08075 -0.07554,-0.163227 0,-0.08378 0.0013,-0.120249 0.0013,-0.147598 0,-0.0395 0.0026,-0.08075 -0.0043,-0.119816 -0.0048,-0.02778 -0.01954,-0.0395 -0.05209,-0.04254 v -0.0217 l 0.0178,8.66e-4 c 0.0204,4.34e-4 0.04905,4.34e-4 0.08595,4.34e-4 0.03777,0 0.06642,0 0.08682,-4.34e-4 l 0.0178,-8.66e-4 v 0.0217 c -0.02431,0.003 -0.03603,0.0091 -0.04384,0.02257 -0.0069,0.01172 -0.01,0.02735 -0.01085,0.06164 -0.0013,0.04862 -0.0022,0.09681 -0.0022,0.145862 0,0.133707 0.003,0.15932 0.02692,0.187537 0.01867,0.02171 0.05079,0.03647 0.08812,0.03647 0.05209,0 0.102451,-0.02648 0.118079,-0.07858 0.01,-0.03343 0.01172,-0.05774 0.01172,-0.145428 v -0.07684 c 0,-0.08856 -0.0026,-0.115908 -0.01085,-0.128931 -0.0087,-0.01433 -0.0204,-0.02214 -0.04037,-0.02431 v -0.0217 c 0.03082,0.0013 0.04167,0.0013 0.08075,0.0013 0.0395,0 0.05036,0 0.08161,-0.0013 v 0.0217 c -0.01736,0.0022 -0.02822,0.0069 -0.03646,0.01693"
         style="fill:#211e1e;fill-opacity:1;fill-rule:nonzero;stroke:none;stroke-width:0.11113299"
         inkscape:connector-curvature="0" />
      <path
         id="path10263"
         d="m 90.142392,70.095327 c -0.0074,0.01172 -0.01519,0.01389 -0.05774,0.01389 -0.02605,0 -0.05209,-0.0013 -0.07857,-0.0022 -0.03733,-8.67e-4 -0.07467,-0.0022 -0.111567,-0.0022 -0.03777,0 -0.07467,4.34e-4 -0.112001,0.0022 v -0.02171 c 0.03473,-0.003 0.05036,-0.02344 0.05383,-0.0573 0.0017,-0.02344 0.0017,-0.04862 0.0017,-0.08899 v -0.219661 c 0,-0.04124 -0.0017,-0.05991 -0.0082,-0.0764 -0.0069,-0.01997 -0.02084,-0.02952 -0.04732,-0.03256 v -0.0217 H 90.1463 c 0,0.02257 -8.67e-4,0.04602 -8.67e-4,0.06816 0,0.01867 -8.67e-4,0.0369 8.67e-4,0.05557 h -0.02822 c -0.0052,-0.05991 -0.03082,-0.0764 -0.123289,-0.0764 -0.01736,0 -0.03994,8.67e-4 -0.05861,0.0017 -0.0013,0.02995 -0.0022,0.04037 -0.0022,0.08552 v 0.08986 c 0.01172,8.67e-4 0.02084,8.67e-4 0.03473,8.67e-4 0.08074,0 0.105923,-0.01172 0.110265,-0.05383 h 0.02822 c -0.0013,0.01259 -0.0013,0.0382 -0.0013,0.07727 0,0.0395 4.33e-4,0.06295 0.0013,0.0751 h -0.02822 c -0.0017,-0.04428 -0.02301,-0.05513 -0.102885,-0.05513 -0.01433,0 -0.02822,8.67e-4 -0.04211,8.67e-4 0,0.04905 8.67e-4,0.09811 8.67e-4,0.14673 0,0.03299 0.0052,0.04385 0.02388,0.04862 0.01172,0.003 0.02952,0.0039 0.05383,0.0039 0.08378,0 0.113303,-0.0191 0.131102,-0.08248 l 0.03039,0.0061 c -0.01085,0.05427 -0.02344,0.09941 -0.03169,0.114172"
         style="fill:#211e1e;fill-opacity:1;fill-rule:nonzero;stroke:none;stroke-width:0.11113299"
         inkscape:connector-curvature="0" />
      <path
         id="path10265"
         d="m 90.861284,69.63126 c -8.67e-4,-0.06772 -0.04037,-0.0942 -0.14673,-0.0942 -0.02171,0 -0.04211,8.67e-4 -0.06555,0.0026 -0.0022,0.06512 -0.0022,0.110265 -0.0022,0.212716 0.02257,8.66e-4 0.03386,0.0017 0.04992,0.0017 0.08726,0 0.113738,-0.01476 0.118513,-0.06555 h 0.03386 c 0,0.02648 -0.0022,0.0534 -0.0022,0.07988 0,0.03473 0.0022,0.07076 0.0022,0.10549 h -0.03386 c -0.0065,-0.05644 -0.02822,-0.06772 -0.127195,-0.06772 -0.01693,0 -0.02344,0 -0.04124,8.67e-4 v 0.10549 c 0,0.0204 0,0.04298 8.67e-4,0.06772 0.0022,0.05166 0.0056,0.09681 0.06685,0.10028 v 0.02648 l -0.02257,-8.67e-4 c -0.02344,-8.66e-4 -0.05817,-8.66e-4 -0.102451,-8.66e-4 -0.04558,0 -0.07901,0 -0.103753,8.66e-4 l -0.02257,8.67e-4 v -0.02648 c 0.04254,-0.0035 0.06121,-0.02778 0.06512,-0.06946 0.003,-0.02822 0.003,-0.04515 0.003,-0.138048 v -0.235289 c 0,-0.04992 -0.003,-0.0725 -0.01042,-0.09247 -0.0087,-0.02431 -0.02561,-0.0356 -0.05774,-0.03951 v -0.02605 h 0.43281 c -0.0017,0.0178 -0.0017,0.04775 -0.0017,0.08726 0,0.03777 0,0.04341 0.0017,0.06425 h -0.03473"
         style="fill:#211e1e;fill-opacity:1;fill-rule:nonzero;stroke:none;stroke-width:0.11113299"
         inkscape:connector-curvature="0" />
      <path
         id="path10267"
         d="m 91.381352,70.113559 c -0.02865,0 -0.04471,-0.0039 -0.06121,-0.01519 -0.02561,-0.01693 -0.05296,-0.06338 -0.06859,-0.08986 -0.02605,-0.04602 -0.05557,-0.09464 -0.08378,-0.135877 -0.0048,4.33e-4 -0.0087,4.33e-4 -0.01172,4.33e-4 -0.0078,0 -0.01389,-4.33e-4 -0.02171,-4.33e-4 v 0.04124 c 0,0.02084 8.67e-4,0.04167 8.67e-4,0.06251 8.67e-4,0.04211 0.0013,0.05991 0.0078,0.0764 0.0078,0.01997 0.02171,0.03039 0.04732,0.03256 v 0.02171 l -0.0178,-8.67e-4 c -0.0204,-4.34e-4 -0.04819,0 -0.08465,0 -0.03603,0 -0.06381,-4.34e-4 -0.08422,0 l -0.01823,8.67e-4 v -0.02171 c 0.0191,-0.0017 0.02865,-0.0056 0.03777,-0.01563 0.0087,-0.01 0.01389,-0.02388 0.01563,-0.04167 0.0022,-0.02344 0.003,-0.03777 0.003,-0.114172 v -0.130668 c 0,-0.09507 -0.003,-0.118078 -0.0087,-0.140218 -0.0052,-0.02084 -0.02171,-0.02952 -0.04775,-0.03256 v -0.0217 c 0.01519,0.0017 0.03082,8.66e-4 0.04645,8.66e-4 0.04037,0 0.05296,0 0.101148,-0.0022 0.04167,-0.0017 0.06599,-0.0026 0.08465,-0.0026 0.05253,0 0.08465,0.0078 0.111133,0.02648 0.02952,0.02084 0.04862,0.06121 0.04862,0.102017 0,0.06338 -0.04167,0.115474 -0.113303,0.141955 0.02952,0.03733 0.05296,0.07467 0.08031,0.117644 0.02474,0.03951 0.04949,0.0738 0.06902,0.0929 0.01085,0.01172 0.0178,0.01563 0.03256,0.01954 v 0.0217 c -0.01997,0.0048 -0.04037,0.0065 -0.06468,0.0065 z m -0.199692,-0.48664 c -0.01563,0 -0.02952,0.0022 -0.04645,0.0061 0,0.04602 -8.66e-4,0.128932 -8.66e-4,0.193615 0.0087,0.0017 0.02431,0.0022 0.03429,0.0022 0.06381,0 0.106358,-0.0395 0.106358,-0.10028 0,-0.05904 -0.0395,-0.101582 -0.09333,-0.101582"
         style="fill:#211e1e;fill-opacity:1;fill-rule:nonzero;stroke:none;stroke-width:0.11113299"
         inkscape:connector-curvature="0" />
      <path
         id="path10269"
         d="m 91.942226,70.10618 c -0.0191,-8.67e-4 -0.04732,-8.67e-4 -0.08292,-8.67e-4 -0.03646,0 -0.06468,0 -0.08378,8.67e-4 l -0.0178,8.66e-4 v -0.0217 c 0.02474,-0.0017 0.0395,-0.01476 0.0395,-0.03647 0,-0.0078 -0.0026,-0.01867 -0.01042,-0.04211 -0.0091,-0.02865 -0.01519,-0.04819 -0.02474,-0.07467 h -0.149335 l -0.01563,0.04515 c -0.01129,0.03516 -0.0178,0.06078 -0.0178,0.0738 0,0.02257 0.01042,0.03256 0.03516,0.0343 v 0.02171 c -0.02952,-8.67e-4 -0.04037,-0.0017 -0.07771,-0.0017 -0.03647,0 -0.04732,8.67e-4 -0.07684,0.0017 v -0.02171 c 0.01172,-0.0017 0.01519,-0.003 0.02388,-0.01085 0.01476,-0.01302 0.02952,-0.04037 0.05296,-0.09941 l 0.0738,-0.188405 c 0.01997,-0.05036 0.05079,-0.131971 0.07163,-0.197956 h 0.05253 c 0.0069,0.02431 0.02344,0.06208 0.0343,0.0903 l 0.10983,0.280437 c 0.01867,0.04732 0.03169,0.0751 0.04167,0.09333 0.01085,0.01867 0.02171,0.02778 0.04037,0.03256 v 0.0217 z M 91.69044,69.725462 c -0.01997,0.05296 -0.04775,0.121118 -0.05991,0.15932 h 0.115474 l -0.05557,-0.15932"
         style="fill:#211e1e;fill-opacity:1;fill-rule:nonzero;stroke:none;stroke-width:0.11113299"
         inkscape:connector-curvature="0" />
      <path
         id="path10271"
         d="m 92.49572,69.633864 c -0.0087,0.01389 -0.01042,0.02692 -0.01172,0.06729 -0.0022,0.07033 -0.003,0.179289 -0.003,0.230948 v 0.118947 c 0,0.0178 0.0022,0.04515 0.0022,0.056 H 92.43024 C 92.37988,70.041059 92.274827,69.913 92.274827,69.913 c -0.01215,-0.01563 -0.109396,-0.135443 -0.158451,-0.195351 0,0.0165 -8.67e-4,0.0065 -8.67e-4,0.05687 v 0.05036 c 0,0.05817 8.67e-4,0.115908 0.0035,0.17408 0.0013,0.03256 0.0043,0.04905 0.01216,0.06381 0.0078,0.01563 0.01954,0.02171 0.04211,0.02257 v 0.02171 c -0.02735,-0.0017 -0.05513,-0.0017 -0.08248,-0.0017 -0.02822,0 -0.05513,0 -0.08291,0.0017 v -0.02171 c 0.05123,-0.0017 0.05253,-0.04428 0.05426,-0.08465 4.33e-4,-0.03256 0.0013,-0.05991 0.0013,-0.109831 v -0.16366 c 0,-0.06468 -0.003,-0.08031 -0.01476,-0.09724 -0.0078,-0.01259 -0.0178,-0.01693 -0.04081,-0.01954 v -0.0217 c 0.02561,0.0013 0.03473,0.0013 0.06729,0.0013 0.03212,0 0.04124,0 0.06685,-0.0013 0.0096,0.01693 0.02431,0.03256 0.07771,0.09811 0.0764,0.09247 0.14456,0.171041 0.208809,0.251786 v -0.169739 c 0,-0.07771 -0.0013,-0.09681 -0.0052,-0.11721 -0.0052,-0.02474 -0.01997,-0.03733 -0.04905,-0.04124 v -0.0217 c 0.03212,0.0013 0.04298,0.0013 0.08248,0.0013 0.0395,0 0.05036,0 0.08248,-0.0013 v 0.0217 c -0.02084,8.67e-4 -0.03256,0.0048 -0.04341,0.02344"
         style="fill:#211e1e;fill-opacity:1;fill-rule:nonzero;stroke:none;stroke-width:0.11113299"
         inkscape:connector-curvature="0" />
      <path
         id="path10273"
         d="m 93.037928,70.088381 c -0.05036,0.0204 -0.09464,0.02822 -0.156281,0.02822 l -0.0069,0.03082 c 0.0039,-8.67e-4 0.01172,0 0.01476,0 0.02952,0 0.04906,0.02127 0.04906,0.04688 0,0.04167 -0.03343,0.0712 -0.08639,0.0712 -0.01563,0 -0.02952,-0.003 -0.04645,-0.01 l 0.01085,-0.03039 c 0.01,0.0039 0.01954,0.0061 0.02778,0.0061 0.02214,0 0.0369,-0.01085 0.0369,-0.02995 0,-0.01563 -0.0078,-0.02474 -0.01954,-0.02474 -0.0065,0 -0.01172,0.0022 -0.01736,0.0061 l -0.01693,-0.0048 0.01563,-0.06295 c -0.06859,-0.0061 -0.118513,-0.02865 -0.160187,-0.07206 -0.04819,-0.04905 -0.0738,-0.115909 -0.0738,-0.194483 0,-0.168002 0.108095,-0.268716 0.286081,-0.268716 0.0534,0 0.105489,0.0074 0.150637,0.02257 -0.0017,0.01736 -0.0017,0.0356 -0.0017,0.05253 0,0.01346 8.67e-4,0.04124 0.0017,0.05904 h -0.03039 c -0.01216,-0.05513 -0.05687,-0.08465 -0.127195,-0.08465 -0.10983,0 -0.176684,0.07293 -0.176684,0.194482 0,0.139785 0.07858,0.241802 0.186669,0.241802 0.06512,0 0.109396,-0.03299 0.127195,-0.09507 l 0.02952,0.0061 c -0.0069,0.02648 -0.01389,0.07076 -0.01693,0.112001"
         style="fill:#211e1e;fill-opacity:1;fill-rule:nonzero;stroke:none;stroke-width:0.11113299"
         inkscape:connector-curvature="0" />
      <path
         id="path10275"
         d="m 93.577096,70.10618 c -0.0191,-8.67e-4 -0.04732,-8.67e-4 -0.08291,-8.67e-4 -0.03647,0 -0.06468,0 -0.08422,8.67e-4 l -0.0178,8.66e-4 v -0.0217 c 0.02475,-0.0017 0.03994,-0.01476 0.03994,-0.03647 0,-0.0078 -0.0026,-0.01867 -0.01042,-0.04211 -0.0096,-0.02865 -0.01563,-0.04819 -0.02474,-0.07467 h -0.149335 l -0.01519,0.04515 c -0.01172,0.03516 -0.01823,0.06077 -0.01823,0.0738 0,0.02257 0.01042,0.03256 0.03516,0.0343 v 0.0217 c -0.02952,-8.66e-4 -0.04037,-0.0017 -0.07771,-0.0017 -0.03647,0 -0.04732,8.67e-4 -0.07684,0.0017 v -0.0217 c 0.01129,-0.0017 0.01563,-0.003 0.02388,-0.01085 0.01476,-0.01302 0.02952,-0.04037 0.05296,-0.09941 l 0.0738,-0.188405 c 0.01997,-0.05036 0.05036,-0.131971 0.07163,-0.197956 h 0.05253 c 0.0069,0.02431 0.02344,0.06208 0.0343,0.0903 l 0.109397,0.280438 c 0.0191,0.04732 0.03212,0.0751 0.04211,0.09333 0.01085,0.01867 0.0217,0.02778 0.04037,0.03256 v 0.02171 z m -0.251785,-0.380718 c -0.0204,0.05296 -0.04819,0.121118 -0.05991,0.15932 h 0.11504 l -0.05513,-0.15932"
         style="fill:#211e1e;fill-opacity:1;fill-rule:nonzero;stroke:none;stroke-width:0.11113299"
         inkscape:connector-curvature="0" />
      <path
         id="path10277"
         d="m 93.831053,70.10618 c -0.0191,-8.67e-4 -0.04775,-8.67e-4 -0.08465,-8.67e-4 -0.03733,0 -0.06512,0 -0.08552,8.67e-4 l -0.01867,8.66e-4 v -0.0217 c 0.03647,-0.003 0.05079,-0.02171 0.05383,-0.0573 0.0022,-0.02344 0.003,-0.03777 0.003,-0.114172 v -0.130668 c 0,-0.0204 -8.67e-4,-0.04124 -8.67e-4,-0.06382 0,-0.04124 -0.0013,-0.05991 -0.0078,-0.0764 -0.0069,-0.01997 -0.0217,-0.02952 -0.04819,-0.03256 v -0.02171 l 0.01867,8.67e-4 c 0.0204,4.33e-4 0.04819,4.33e-4 0.08552,4.33e-4 0.0369,0 0.06555,0 0.08465,-4.33e-4 l 0.01867,-8.67e-4 v 0.02171 c -0.03343,0.0026 -0.05036,0.02344 -0.0534,0.05817 -0.0026,0.02257 -0.0026,0.04471 -0.0026,0.114606 v 0.130668 c 0,0.101582 8.67e-4,0.118513 0.0087,0.138916 0.0069,0.01997 0.02084,0.03039 0.04732,0.03256 v 0.0217 l -0.01867,-8.66e-4"
         style="fill:#211e1e;fill-opacity:1;fill-rule:nonzero;stroke:none;stroke-width:0.11113299"
         inkscape:connector-curvature="0" />
      <path
         id="path10279"
         d="m 94.072854,70.116598 c -0.04515,0 -0.07771,-0.0065 -0.130668,-0.02648 -0.0022,-0.02952 -0.0078,-0.07467 -0.01389,-0.112001 l 0.02952,-0.0048 c 0.01867,0.06295 0.05991,0.0955 0.119381,0.0955 0.05557,0 0.0929,-0.02865 0.0929,-0.07206 0,-0.03516 -0.02431,-0.05904 -0.05904,-0.08074 l -0.08161,-0.05209 c -0.05643,-0.03603 -0.08899,-0.07337 -0.08899,-0.141521 0,-0.08682 0.06642,-0.142823 0.16887,-0.142823 0.04949,0 0.09073,0.0091 0.12763,0.02778 -8.67e-4,0.01867 -8.67e-4,0.02474 -8.67e-4,0.04905 0,0.02778 0,0.0356 8.67e-4,0.0573 h -0.02952 c -0.01129,-0.05557 -0.04602,-0.08682 -0.09941,-0.08682 -0.04862,0 -0.08335,0.02995 -0.08335,0.07293 0,0.03733 0.02561,0.06208 0.06685,0.08856 l 0.06598,0.04298 c 0.06295,0.04124 0.09854,0.08075 0.09854,0.142823 0,0.08465 -0.07467,0.142389 -0.183196,0.142389"
         style="fill:#211e1e;fill-opacity:1;fill-rule:nonzero;stroke:none;stroke-width:0.11113299"
         inkscape:connector-curvature="0" />
      <path
         id="path10281"
         d="m 94.697542,70.095327 c -0.0069,0.01172 -0.01476,0.01389 -0.05774,0.01389 -0.02605,0 -0.05166,-0.0013 -0.07814,-0.0022 -0.03733,-8.67e-4 -0.07467,-0.0022 -0.112002,-0.0022 -0.03733,0 -0.07467,4.34e-4 -0.112001,0.0022 v -0.02171 c 0.03516,-0.003 0.05079,-0.02344 0.05383,-0.0573 0.0022,-0.02344 0.0022,-0.04862 0.0022,-0.08899 v -0.219661 c 0,-0.04124 -0.0022,-0.05991 -0.0087,-0.0764 -0.0069,-0.01997 -0.02084,-0.02952 -0.04732,-0.03256 v -0.0217 h 0.363787 c 0,0.02257 -8.89e-4,0.04602 -8.89e-4,0.06816 0,0.01867 -8.89e-4,0.0369 8.89e-4,0.05557 h -0.02778 c -0.0056,-0.05991 -0.03126,-0.0764 -0.123723,-0.0764 -0.01736,0 -0.0395,8.67e-4 -0.05817,0.0017 -0.0017,0.02995 -0.0026,0.04037 -0.0026,0.08552 v 0.08986 c 0.01172,8.67e-4 0.02127,8.67e-4 0.03516,8.67e-4 0.08075,0 0.10549,-0.01172 0.110265,-0.05383 h 0.02822 c -0.0017,0.01259 -0.0017,0.0382 -0.0017,0.07727 0,0.0395 8.89e-4,0.06295 0.0017,0.0751 H 94.6346 c -0.0022,-0.04428 -0.02344,-0.05513 -0.103319,-0.05513 -0.01389,0 -0.02778,8.67e-4 -0.04211,8.67e-4 0,0.04905 8.89e-4,0.09811 8.89e-4,0.14673 0,0.03299 0.0056,0.04385 0.02431,0.04862 0.01129,0.003 0.02952,0.0039 0.0534,0.0039 0.08422,0 0.113738,-0.0191 0.131537,-0.08248 l 0.03039,0.0061 c -0.01086,0.05427 -0.02344,0.09941 -0.03213,0.114172"
         style="fill:#211e1e;fill-opacity:1;fill-rule:nonzero;stroke:none;stroke-width:0.11113299"
         inkscape:connector-curvature="0" />
      <path
         id="path10283"
         d="m 85.522125,68.776925 c -0.0069,0.0091 -0.01823,0.01172 -0.04558,0.01172 -0.0369,0 -0.07337,-0.0022 -0.110264,-0.0026 -0.03213,-8.67e-4 -0.056,-0.0017 -0.07293,-0.0017 -0.02257,0 -0.07771,8.67e-4 -0.09377,0.0017 l -0.01042,4.33e-4 0.003,-0.01563 c 0.02257,-0.0022 0.03603,-0.0091 0.04688,-0.02344 0.01216,-0.01519 0.01954,-0.03647 0.02995,-0.07901 0.01,-0.04124 0.01433,-0.06642 0.03039,-0.144125 l 0.01216,-0.05991 c 0.01215,-0.06034 0.0165,-0.09637 0.0165,-0.11504 0,-0.03343 -0.01172,-0.04688 -0.04471,-0.05079 l 0.003,-0.01649 c 0.0048,8.66e-4 0.0087,8.66e-4 0.01085,8.66e-4 0.02822,0 0.05513,4.34e-4 0.08335,4.34e-4 0.04384,0 0.0725,-4.34e-4 0.08552,-4.34e-4 0.0022,0 0.0065,0 0.01172,-8.66e-4 l -0.0026,0.0165 c -0.02344,0.0017 -0.03646,0.0078 -0.04775,0.02257 -0.0191,0.02431 -0.02952,0.05687 -0.05774,0.203165 l -0.0096,0.05079 c -0.01216,0.06164 -0.01693,0.08292 -0.0204,0.111133 -0.0017,0.0091 -0.0026,0.01867 -0.0026,0.02344 0,0.02952 0.01519,0.0382 0.06381,0.0382 0.08552,0 0.117211,-0.01736 0.145428,-0.07944 l 0.0204,0.0078 c -0.01823,0.04992 -0.0356,0.08856 -0.04471,0.100715"
         style="fill:#211e1e;fill-opacity:1;fill-rule:nonzero;stroke:none;stroke-width:0.11113299"
         inkscape:connector-curvature="0" />
      <path
         id="path10285"
         d="m 85.746562,68.408363 c -0.02344,0 -0.0382,-0.01433 -0.0382,-0.03647 0,-0.02692 0.01954,-0.04602 0.04688,-0.04602 0.02257,0 0.0369,0.01346 0.0369,0.0356 0,0.02735 -0.0191,0.04688 -0.04558,0.04688 z m -0.08248,0.386795 c -0.01519,0 -0.02474,-0.0087 -0.02474,-0.02214 0,-0.0065 0.0022,-0.0191 0.0061,-0.0356 0.0096,-0.03994 0.02344,-0.09464 0.03082,-0.123288 0.01085,-0.03907 0.01519,-0.06642 0.01519,-0.07727 0,-0.01 -0.0043,-0.01433 -0.01259,-0.01433 -0.0069,0 -0.01389,0.0022 -0.02995,0.0069 l -0.0052,0.0013 -0.0022,-0.02084 c 0.04167,-0.01606 0.08248,-0.02605 0.102885,-0.02605 0.01129,0 0.01606,0.0039 0.01606,0.01302 0,0.0091 -0.0039,0.03343 -0.01736,0.08639 l -0.01129,0.04471 c -0.0191,0.07337 -0.02344,0.09898 -0.02344,0.111133 0,0.01129 0.0056,0.01823 0.01736,0.01823 0.0065,0 0.0204,-0.0035 0.04124,-0.01085 l 0.0017,0.02127 c -0.03994,0.01606 -0.08335,0.02735 -0.104621,0.02735"
         style="fill:#211e1e;fill-opacity:1;fill-rule:nonzero;stroke:none;stroke-width:0.11113299"
         inkscape:connector-curvature="0" />
      <path
         id="path10287"
         d="m 86.081263,68.75956 c -0.02995,0.02561 -0.06468,0.03603 -0.118079,0.03603 -0.05947,0 -0.09464,-0.0096 -0.09464,-0.02474 0,-0.0061 4.33e-4,-0.01389 0.0082,-0.04558 l 0.03907,-0.171909 c 0.01302,-0.05513 0.02257,-0.09898 0.03647,-0.161056 0.0074,-0.03603 0.01085,-0.056 0.01085,-0.06555 0,-0.0091 -0.0048,-0.01433 -0.01346,-0.01433 -0.0052,0 -0.02127,0.0035 -0.03299,0.0074 l -8.67e-4,-0.02171 0.0091,-0.0035 c 0.04124,-0.01346 0.0751,-0.02084 0.09073,-0.02084 0.01,0 0.01606,0.0043 0.01606,0.01259 0,0.0082 -0.0039,0.02735 -0.0165,0.08335 l -0.02301,0.09985 c -0.0074,0.03256 -0.01,0.04471 -0.01172,0.05513 0.04732,-0.02778 0.08899,-0.04081 0.126761,-0.04081 0.04602,0 0.06902,0.02344 0.06902,0.0712 0,0.07033 -0.04037,0.156715 -0.09507,0.204467 z m -0.0013,-0.243103 c -0.01346,0 -0.02995,0.0052 -0.05123,0.01693 -0.02214,0.01129 -0.03777,0.02344 -0.04645,0.03473 -0.0096,0.01346 -0.0178,0.0369 -0.02952,0.08682 -0.01085,0.04688 -0.0165,0.0764 -0.0165,0.08726 0,0.01432 0.0165,0.02257 0.04732,0.02257 0.03082,0 0.0573,-0.01433 0.07684,-0.04254 0.03039,-0.04298 0.05296,-0.112002 0.05296,-0.161056 0,-0.02865 -0.01129,-0.04471 -0.03343,-0.04471"
         style="fill:#211e1e;fill-opacity:1;fill-rule:nonzero;stroke:none;stroke-width:0.11113299"
         inkscape:connector-curvature="0" />
      <path
         id="path10289"
         d="m 86.341297,68.665358 c -0.0052,0 -0.01215,0 -0.02214,-4.34e-4 -0.0022,0.01346 -0.0026,0.02474 -0.0026,0.03603 0,0.03864 0.01346,0.05947 0.03994,0.05947 0.02388,0 0.05426,-0.01302 0.09898,-0.04124 l 0.0082,0.02561 c -0.05557,0.03516 -0.09811,0.05079 -0.136746,0.05079 -0.04688,0 -0.07293,-0.02778 -0.07293,-0.07857 0,-0.125025 0.08509,-0.233119 0.182762,-0.233119 0.04775,0 0.07554,0.02214 0.07554,0.05991 0,0.06946 -0.07423,0.121551 -0.17104,0.121551 z m 0.07814,-0.151072 c -0.03647,0 -0.0751,0.04992 -0.0942,0.123288 h 0.0078 c 0.07033,0 0.123288,-0.0369 0.123288,-0.08552 0,-0.02127 -0.0165,-0.03777 -0.0369,-0.03777"
         style="fill:#211e1e;fill-opacity:1;fill-rule:nonzero;stroke:none;stroke-width:0.11113299"
         inkscape:connector-curvature="0" />
      <path
         id="path10291"
         d="m 86.815783,68.581574 -0.02518,-0.0022 c 0.0017,-0.0091 0.0026,-0.01997 0.0026,-0.02952 0,-0.01389 -0.01216,-0.02344 -0.03126,-0.02344 -0.01129,0 -0.02257,0.0065 -0.03256,0.01823 -0.02865,0.03212 -0.03994,0.08378 -0.05687,0.168002 l -0.01433,0.07336 c -0.02865,0.0013 -0.03647,0.0022 -0.06555,0.0061 0.0074,-0.02908 0.01302,-0.05166 0.0191,-0.07727 l 0.0165,-0.07033 c 0.01129,-0.04775 0.0165,-0.07727 0.0165,-0.09333 0,-0.01867 -0.0043,-0.02735 -0.01346,-0.02735 -0.0048,0 -0.01129,0.0017 -0.0191,0.0039 l -0.0191,0.0061 -0.0017,-0.02257 c 0.0369,-0.01519 0.07901,-0.02735 0.09811,-0.02735 0.0078,0 0.01216,0.003 0.01346,0.01042 0.0022,0.0091 0.0039,0.01997 0.0043,0.03256 0.0343,-0.02778 0.06468,-0.04385 0.08595,-0.04385 0.01433,0 0.03212,0.0078 0.04992,0.0204 -0.01215,0.02735 -0.02127,0.05253 -0.02735,0.07814"
         style="fill:#211e1e;fill-opacity:1;fill-rule:nonzero;stroke:none;stroke-width:0.11113299"
         inkscape:connector-curvature="0" />
      <path
         id="path10293"
         d="m 87.072344,68.529914 -0.06295,-0.0013 -0.03169,0.154978 c -0.0082,0.04037 -0.0091,0.05166 -0.0091,0.05774 0,0.01042 0.0052,0.0165 0.01519,0.0165 0.0052,0 0.0165,-0.003 0.03473,-0.0082 l 0.0074,-0.0022 0.0026,0.02171 c -0.0395,0.01606 -0.08031,0.02648 -0.102451,0.02648 -0.01563,0 -0.02561,-0.0074 -0.02561,-0.02171 0,-0.01302 0.003,-0.03169 0.0091,-0.05557 0.0069,-0.02648 0.01215,-0.04819 0.01823,-0.07771 l 0.02344,-0.112001 -0.04037,8.67e-4 0.0056,-0.02431 c 0.05123,-0.0091 0.06859,-0.04992 0.08292,-0.09377 l 0.03646,-0.0078 -0.0191,0.08943 0.06295,-8.67e-4 -0.0074,0.03777"
         style="fill:#211e1e;fill-opacity:1;fill-rule:nonzero;stroke:none;stroke-width:0.11113299"
         inkscape:connector-curvature="0" />
      <path
         id="path10295"
         d="m 87.304594,68.437014 -0.02431,-0.01954 0.09247,-0.104621 0.06816,0.01693 z m -0.08422,0.228778 c -0.0052,0 -0.01172,0 -0.0217,-8.67e-4 -0.0026,0.01346 -0.0035,0.02474 -0.0035,0.03647 0,0.03864 0.01389,0.05904 0.04037,0.05904 0.02431,0 0.0547,-0.01302 0.09941,-0.04124 l 0.0082,0.02605 c -0.05643,0.03473 -0.09854,0.05079 -0.13718,0.05079 -0.04688,0 -0.0725,-0.02822 -0.0725,-0.07901 0,-0.12459 0.08465,-0.233119 0.182327,-0.233119 0.04775,0 0.07597,0.02214 0.07597,0.05991 0,0.06946 -0.07423,0.121986 -0.171475,0.121986 z m 0.07814,-0.151506 c -0.03647,0 -0.0751,0.04992 -0.09377,0.123288 h 0.0074 c 0.07033,0 0.123288,-0.0369 0.123288,-0.08552 0,-0.02127 -0.0165,-0.03777 -0.0369,-0.03777"
         style="fill:#211e1e;fill-opacity:1;fill-rule:nonzero;stroke:none;stroke-width:0.11113299"
         inkscape:connector-curvature="0" />
      <path
         id="path10297"
         d="m 88.604763,68.231244 -0.02431,-0.01954 0.09247,-0.104621 0.06859,0.0165 z m 0.143692,0.161056 h -0.02214 c 8.67e-4,-0.0082 0.0017,-0.01129 0.0017,-0.0165 0,-0.04167 -0.02735,-0.056 -0.102885,-0.056 -0.02518,0 -0.04906,0 -0.07423,0.0022 -0.01563,0.06295 -0.02648,0.117211 -0.03907,0.184932 0.01172,0 0.01563,0 0.02778,0 0.04819,0 0.06859,-8.67e-4 0.08595,-0.0039 0.02822,-0.0056 0.04515,-0.02214 0.0534,-0.05209 h 0.0204 c -0.01085,0.04428 -0.02344,0.108095 -0.02865,0.146731 h -0.02084 c 8.67e-4,-0.0056 0.0017,-0.01 0.0017,-0.01302 0,-0.03256 -0.0204,-0.04298 -0.08248,-0.04298 -0.0369,0 -0.05079,8.67e-4 -0.06425,0.0013 -0.0039,0.0191 0,0.0022 -0.01736,0.08943 -0.0087,0.04211 -0.01172,0.06902 -0.01172,0.08248 0,0.02648 0.01389,0.03299 0.06468,0.03299 0.09507,0 0.12459,-0.01476 0.15411,-0.07988 l 0.0191,0.0074 c -0.01693,0.04992 -0.03473,0.0903 -0.04558,0.102885 -0.0074,0.0082 -0.01736,0.01085 -0.04905,0.01085 -0.02648,0 -0.05383,-8.66e-4 -0.08031,-0.0017 -0.03473,-8.66e-4 -0.07033,-0.0013 -0.105055,-0.0013 -0.0356,0 -0.07033,4.33e-4 -0.105924,4.33e-4 l 0.003,-0.01563 c 0.02257,-0.0022 0.03603,-0.0091 0.04688,-0.02344 0.01215,-0.01519 0.01953,-0.03647 0.02995,-0.07857 0.01,-0.04254 0.01346,-0.05991 0.03039,-0.14456 l 0.01216,-0.05991 c 0.01215,-0.05904 0.01693,-0.09637 0.01693,-0.11504 0,-0.03343 -0.01216,-0.04688 -0.04515,-0.05079 l 0.0035,-0.0165 h 0.344251 c -0.0087,0.03386 -0.01606,0.07467 -0.02127,0.110264"
         style="fill:#211e1e;fill-opacity:1;fill-rule:nonzero;stroke:none;stroke-width:0.11113299"
         inkscape:connector-curvature="0" />
      <path
         id="path10299"
         d="m 89.122226,68.52948 -0.05166,-8.67e-4 c 0.0091,0.01606 0.01259,0.02822 0.01259,0.04558 0,0.06946 -0.05861,0.123288 -0.134141,0.123288 -0.01433,0 -0.02518,-0.0017 -0.04081,-0.0061 -0.0191,0.01129 -0.02518,0.0165 -0.02518,0.02344 0,0.0082 0.0087,0.01215 0.04167,0.02257 l 0.06078,0.0191 c 0.06034,0.01867 0.08986,0.0369 0.08986,0.08074 0,0.08031 -0.07944,0.143257 -0.180591,0.143257 -0.08335,0 -0.134141,-0.0395 -0.134141,-0.103753 0,-0.05904 0.03777,-0.08726 0.09985,-0.102885 -0.03777,-0.01346 -0.04602,-0.01997 -0.04602,-0.03256 0,-0.0165 0.02214,-0.0369 0.06729,-0.06208 -0.02344,-0.0165 -0.03473,-0.03864 -0.03473,-0.06902 0,-0.07163 0.0573,-0.126327 0.133272,-0.126327 0.01954,0 0.03386,0.0026 0.05036,0.0087 h 0.09985 z m -0.144559,-0.0165 c -0.04081,0 -0.07423,0.04298 -0.07423,0.0942 0,0.0356 0.0204,0.05991 0.04992,0.05991 0.04037,0 0.07293,-0.04168 0.07293,-0.0929 0,-0.03777 -0.0191,-0.06121 -0.04862,-0.06121 z m 0.01172,0.306484 c -0.02605,-0.01 -0.0573,-0.02084 -0.08899,-0.02995 -0.05209,0.01302 -0.08856,0.05166 -0.08856,0.09551 0,0.04081 0.03516,0.06816 0.08943,0.06816 0.06598,0 0.126327,-0.04471 0.126327,-0.0929 0,-0.01823 -0.01129,-0.03039 -0.0382,-0.04081"
         style="fill:#211e1e;fill-opacity:1;fill-rule:nonzero;stroke:none;stroke-width:0.11113299"
         inkscape:connector-curvature="0" />
      <path
         id="path10301"
         d="m 89.406571,68.795592 c -0.01346,0 -0.0178,-0.0082 -0.02518,-0.04515 -0.05557,0.03169 -0.09637,0.04602 -0.136746,0.04602 -0.04515,0 -0.07206,-0.02344 -0.07206,-0.06512 0,-0.03994 0.01997,-0.09681 0.05036,-0.143692 0.04081,-0.06338 0.0916,-0.103753 0.16887,-0.103753 0.03386,0 0.06468,0.0061 0.09724,0.01433 l -0.0035,0.01216 c -0.02735,0.08726 -0.04732,0.183196 -0.04732,0.215755 0,0.0204 0.0048,0.03169 0.01389,0.03169 0.0061,0 0.02171,-0.0043 0.04081,-0.01129 l 0.0022,0.02344 c -0.03864,0.01433 -0.07554,0.02561 -0.08856,0.02561 z m -0.03473,-0.280003 c -0.03039,0 -0.06034,0.02301 -0.08595,0.06512 -0.02909,0.04645 -0.04949,0.10766 -0.04949,0.147598 0,0.02344 0.01129,0.03647 0.03039,0.03647 0.02778,0 0.07684,-0.02518 0.09594,-0.04385 0.01085,-0.01085 0.0165,-0.02561 0.02431,-0.0547 0.01216,-0.04602 0.02344,-0.08943 0.03039,-0.13935 -0.01693,-0.0074 -0.03299,-0.01129 -0.04558,-0.01129"
         style="fill:#211e1e;fill-opacity:1;fill-rule:nonzero;stroke:none;stroke-width:0.11113299"
         inkscape:connector-curvature="0" />
      <path
         id="path10303"
         d="m 89.741706,68.350626 c -0.02474,0.100714 -0.04992,0.212715 -0.0738,0.319507 -0.0078,0.03473 -0.01129,0.05774 -0.01129,0.06902 0,0.01129 0.0052,0.0165 0.0165,0.0165 0.0074,0 0.02084,-0.003 0.04124,-0.0091 l 0.0017,0.02127 c -0.03864,0.01519 -0.08552,0.02778 -0.105924,0.02778 -0.01432,0 -0.02257,-0.0082 -0.02257,-0.02257 0,-0.01042 0.0022,-0.02431 0.01346,-0.07206 0.02344,-0.09985 0.04905,-0.206638 0.06989,-0.301709 0.0087,-0.04385 0.01346,-0.06599 0.01346,-0.0725 0,-0.0091 -0.0048,-0.01389 -0.01302,-0.01389 -0.0078,0 -0.02127,0.003 -0.03343,0.0078 l -0.0013,-0.02301 c 0.03864,-0.01346 0.08074,-0.02388 0.10245,-0.02388 0.01,0 0.01563,0.0043 0.01563,0.01259 0,0.0078 -0.003,0.02518 -0.01302,0.06425"
         style="fill:#211e1e;fill-opacity:1;fill-rule:nonzero;stroke:none;stroke-width:0.11113299"
         inkscape:connector-curvature="0" />
      <path
         id="path10305"
         d="m 89.929243,68.408363 c -0.02344,0 -0.0382,-0.01433 -0.0382,-0.03647 0,-0.02692 0.01954,-0.04602 0.04645,-0.04602 0.02301,0 0.03733,0.01346 0.03733,0.0356 0,0.02735 -0.0191,0.04688 -0.04558,0.04688 z m -0.08248,0.386795 c -0.01519,0 -0.02474,-0.0087 -0.02474,-0.02214 0,-0.0065 0.0022,-0.0191 0.0061,-0.0356 0.0096,-0.03994 0.02344,-0.09464 0.03126,-0.123288 0.01042,-0.03907 0.01476,-0.06642 0.01476,-0.07727 0,-0.01 -0.0043,-0.01433 -0.01302,-0.01433 -0.0065,0 -0.01346,0.0022 -0.02952,0.0069 l -0.0052,0.0013 -0.0022,-0.02084 c 0.04167,-0.01606 0.08248,-0.02605 0.102885,-0.02605 0.01129,0 0.01606,0.0039 0.01606,0.01302 0,0.0091 -0.0039,0.03343 -0.01736,0.08639 l -0.01129,0.04471 c -0.0191,0.07337 -0.02344,0.09898 -0.02344,0.111133 0,0.01129 0.0061,0.01823 0.01736,0.01823 0.0065,0 0.0204,-0.0035 0.04124,-0.01085 l 0.0017,0.02127 c -0.03994,0.01606 -0.08335,0.02735 -0.104621,0.02735"
         style="fill:#211e1e;fill-opacity:1;fill-rule:nonzero;stroke:none;stroke-width:0.11113299"
         inkscape:connector-curvature="0" />
      <path
         id="path10307"
         d="m 90.227479,68.529914 -0.06295,-0.0013 -0.03169,0.154978 c -0.0082,0.04037 -0.0091,0.05166 -0.0091,0.05774 0,0.01042 0.0052,0.0165 0.01519,0.0165 0.0052,0 0.0165,-0.003 0.03473,-0.0082 l 0.0074,-0.0022 0.0026,0.02171 c -0.0395,0.01606 -0.08031,0.02648 -0.102017,0.02648 -0.01606,0 -0.02605,-0.0074 -0.02605,-0.02171 0,-0.01302 0.003,-0.03169 0.0091,-0.05557 0.0065,-0.02648 0.01215,-0.04819 0.01823,-0.07771 l 0.02344,-0.112001 -0.04037,8.67e-4 0.0052,-0.02431 c 0.05166,-0.0091 0.06902,-0.04992 0.08335,-0.09377 l 0.03646,-0.0078 -0.0191,0.08943 0.06295,-8.67e-4 -0.0074,0.03777"
         style="fill:#211e1e;fill-opacity:1;fill-rule:nonzero;stroke:none;stroke-width:0.11113299"
         inkscape:connector-curvature="0" />
      <path
         id="path10309"
         d="m 90.459729,68.437014 -0.02431,-0.01954 0.09247,-0.104621 0.06816,0.01693 z m -0.08422,0.228778 c -0.0052,0 -0.01216,0 -0.0217,-8.67e-4 -0.0022,0.01346 -0.003,0.02474 -0.003,0.03647 0,0.03864 0.01346,0.05904 0.03994,0.05904 0.02431,0 0.0547,-0.01302 0.09941,-0.04124 l 0.0082,0.02605 c -0.056,0.03473 -0.09854,0.05079 -0.13718,0.05079 -0.04689,0 -0.0725,-0.02822 -0.0725,-0.07901 0,-0.12459 0.08465,-0.233119 0.182327,-0.233119 0.04775,0 0.07597,0.02214 0.07597,0.05991 0,0.06946 -0.07467,0.121986 -0.171475,0.121986 z m 0.07814,-0.151506 c -0.03647,0 -0.0751,0.04992 -0.09377,0.123288 h 0.0074 c 0.07033,0 0.123288,-0.0369 0.123288,-0.08552 0,-0.02127 -0.0165,-0.03777 -0.0369,-0.03777"
         style="fill:#211e1e;fill-opacity:1;fill-rule:nonzero;stroke:none;stroke-width:0.11113299"
         inkscape:connector-curvature="0" />
      <path
         id="path10311"
         d="m 91.893171,68.391432 h -0.0217 c 8.66e-4,-0.0074 0.0013,-0.01346 0.0013,-0.01736 0,-0.01519 -0.0052,-0.02691 -0.01433,-0.03603 -0.01433,-0.01346 -0.04124,-0.0191 -0.09811,-0.0191 -0.01606,0 -0.03733,8.67e-4 -0.056,0.0017 -0.01389,0.06208 -0.02605,0.121552 -0.0395,0.185801 0.01432,0 0.02865,8.67e-4 0.04298,8.67e-4 0.08422,0 0.100714,-0.0074 0.116776,-0.05687 h 0.01997 c -0.01172,0.04949 -0.02171,0.09768 -0.02865,0.147598 h -0.02084 c 8.67e-4,-0.0052 0.0013,-0.0096 0.0013,-0.01259 0,-0.01302 -0.0052,-0.02518 -0.01433,-0.03212 -0.01259,-0.0096 -0.02778,-0.01172 -0.07336,-0.01172 -0.02431,0 -0.03082,4.33e-4 -0.05079,0.0013 l -0.0096,0.05079 c -0.01476,0.0725 -0.01997,0.106792 -0.01997,0.12763 0,0.03126 0.01389,0.04558 0.04471,0.04949 l -0.003,0.01563 -0.01215,-4.34e-4 c -0.0061,0 -0.0395,-8.67e-4 -0.06816,-8.67e-4 -0.02995,0 -0.08639,0 -0.09594,8.67e-4 l -0.01302,4.34e-4 0.003,-0.01563 c 0.02257,-0.0022 0.03647,-0.0091 0.04732,-0.02344 0.01172,-0.01519 0.0204,-0.03647 0.02995,-0.07901 0.01042,-0.04298 0.01433,-0.06555 0.03039,-0.14456 l 0.01216,-0.05947 c 0.01172,-0.05991 0.0165,-0.09637 0.0165,-0.11504 0,-0.03343 -0.01216,-0.04689 -0.04471,-0.05079 l 0.003,-0.01649 h 0.336004 c -0.0074,0.03386 -0.01519,0.07336 -0.02127,0.109396"
         style="fill:#211e1e;fill-opacity:1;fill-rule:nonzero;stroke:none;stroke-width:0.11113299"
         inkscape:connector-curvature="0" />
      <path
         id="path10313"
         d="m 92.151034,68.581574 -0.02474,-0.0022 c 0.0013,-0.0091 0.0022,-0.01997 0.0022,-0.02952 0,-0.01389 -0.01216,-0.02344 -0.03082,-0.02344 -0.01129,0 -0.02301,0.0065 -0.03299,0.01823 -0.02865,0.03212 -0.03994,0.08378 -0.05643,0.168002 l -0.01433,0.07336 c -0.02909,0.0013 -0.03647,0.0022 -0.06599,0.0061 0.0074,-0.02908 0.01302,-0.05166 0.01867,-0.07727 l 0.01693,-0.07033 c 0.01129,-0.04775 0.0165,-0.07727 0.0165,-0.09333 0,-0.01867 -0.0043,-0.02735 -0.01346,-0.02735 -0.0048,0 -0.01129,0.0017 -0.0191,0.0039 l -0.01867,0.0061 -0.0026,-0.02257 c 0.03733,-0.01519 0.07988,-0.02735 0.09854,-0.02735 0.0078,0 0.01216,0.003 0.01346,0.01042 0.0026,0.0091 0.0039,0.01997 0.0048,0.03256 0.03386,-0.02778 0.06425,-0.04385 0.08552,-0.04385 0.01432,0 0.03256,0.0078 0.04992,0.0204 -0.01215,0.02735 -0.02127,0.05253 -0.02735,0.07814"
         style="fill:#211e1e;fill-opacity:1;fill-rule:nonzero;stroke:none;stroke-width:0.11113299"
         inkscape:connector-curvature="0" />
      <path
         id="path10315"
         d="m 92.449704,68.795592 c -0.01346,0 -0.01823,-0.0082 -0.02518,-0.04515 -0.056,0.03169 -0.09681,0.04602 -0.136746,0.04602 -0.04558,0 -0.07206,-0.02344 -0.07206,-0.06512 0,-0.03994 0.01997,-0.09681 0.04992,-0.143692 0.04124,-0.06338 0.0916,-0.103753 0.16887,-0.103753 0.0343,0 0.06512,0.0061 0.09768,0.01433 l -0.0039,0.01216 c -0.02735,0.08726 -0.04689,0.183196 -0.04689,0.215755 0,0.0204 0.0043,0.03169 0.01346,0.03169 0.0061,0 0.02171,-0.0043 0.04124,-0.01129 l 0.0022,0.02344 c -0.03864,0.01433 -0.07554,0.02561 -0.08856,0.02561 z m -0.03516,-0.280003 c -0.02995,0 -0.06034,0.02301 -0.08595,0.06512 -0.02865,0.04645 -0.04905,0.10766 -0.04905,0.147598 0,0.02344 0.01129,0.03647 0.03039,0.03647 0.02778,0 0.07684,-0.02518 0.0955,-0.04385 0.01085,-0.01085 0.01693,-0.02561 0.02474,-0.0547 0.01215,-0.04602 0.02344,-0.08943 0.02995,-0.13935 -0.0165,-0.0074 -0.03212,-0.01129 -0.04558,-0.01129"
         style="fill:#211e1e;fill-opacity:1;fill-rule:nonzero;stroke:none;stroke-width:0.11113299"
         inkscape:connector-curvature="0" />
      <path
         id="path10317"
         d="m 92.810453,68.529914 -0.06251,-0.0013 -0.03212,0.154978 c -0.0082,0.04037 -0.0087,0.05166 -0.0087,0.05774 0,0.01042 0.0052,0.0165 0.01476,0.0165 0.0056,0 0.0165,-0.003 0.03516,-0.0082 l 0.0074,-0.0022 0.0022,0.02171 c -0.03907,0.01606 -0.07988,0.02648 -0.102017,0.02648 -0.01563,0 -0.02561,-0.0074 -0.02561,-0.02171 0,-0.01302 0.0026,-0.03169 0.0091,-0.05557 0.0065,-0.02648 0.01172,-0.04819 0.01823,-0.07771 l 0.02301,-0.112001 -0.03994,8.67e-4 0.0052,-0.02431 c 0.05166,-0.0091 0.06902,-0.04992 0.08335,-0.09377 l 0.03647,-0.0078 -0.0191,0.08943 0.06295,-8.67e-4 -0.0078,0.03777"
         style="fill:#211e1e;fill-opacity:1;fill-rule:nonzero;stroke:none;stroke-width:0.11113299"
         inkscape:connector-curvature="0" />
      <path
         id="path10319"
         d="m 92.958919,68.665358 c -0.0052,0 -0.01215,0 -0.02214,-4.34e-4 -0.0022,0.01346 -0.003,0.02474 -0.003,0.03603 0,0.03864 0.01346,0.05947 0.04037,0.05947 0.02388,0 0.05426,-0.01302 0.09898,-0.04124 l 0.0082,0.02561 c -0.056,0.03516 -0.09811,0.05079 -0.136746,0.05079 -0.04688,0 -0.0725,-0.02778 -0.0725,-0.07857 0,-0.125025 0.08422,-0.233119 0.181894,-0.233119 0.04819,0 0.07597,0.02214 0.07597,0.05991 0,0.06946 -0.07423,0.121551 -0.17104,0.121551 z m 0.07814,-0.151072 c -0.03647,0 -0.0751,0.04992 -0.0942,0.123288 h 0.0078 c 0.07033,0 0.123288,-0.0369 0.123288,-0.08552 0,-0.02127 -0.0165,-0.03777 -0.0369,-0.03777"
         style="fill:#211e1e;fill-opacity:1;fill-rule:nonzero;stroke:none;stroke-width:0.11113299"
         inkscape:connector-curvature="0" />
      <path
         id="path10321"
         d="m 93.433405,68.581574 -0.02518,-0.0022 c 0.0017,-0.0091 0.0022,-0.01997 0.0022,-0.02952 0,-0.01389 -0.01172,-0.02344 -0.03082,-0.02344 -0.01129,0 -0.02257,0.0065 -0.03256,0.01823 -0.02865,0.03212 -0.03994,0.08378 -0.05687,0.168002 l -0.01433,0.07336 c -0.02865,0.0013 -0.03603,0.0022 -0.06555,0.0061 0.0074,-0.02909 0.01302,-0.05166 0.01867,-0.07727 l 0.01693,-0.07033 c 0.01129,-0.04775 0.0165,-0.07727 0.0165,-0.09333 0,-0.01867 -0.0043,-0.02735 -0.01346,-0.02735 -0.0048,0 -0.01129,0.0017 -0.0191,0.0039 l -0.01867,0.0061 -0.0026,-0.02257 c 0.03733,-0.01519 0.07944,-0.02735 0.09854,-0.02735 0.0074,0 0.01215,0.003 0.01346,0.01042 0.0026,0.0091 0.0039,0.01997 0.0048,0.03256 0.03386,-0.02778 0.06425,-0.04385 0.08509,-0.04385 0.01476,0 0.03299,0.0078 0.05036,0.0204 -0.01215,0.02735 -0.02127,0.05253 -0.02735,0.07814"
         style="fill:#211e1e;fill-opacity:1;fill-rule:nonzero;stroke:none;stroke-width:0.11113299"
         inkscape:connector-curvature="0" />
      <path
         id="path10323"
         d="m 93.735114,68.795592 c -0.01563,0 -0.02431,-0.0091 -0.02431,-0.02257 0,-0.0091 0.003,-0.02561 0.01216,-0.06338 l 0.0074,-0.03212 c 0.02257,-0.0942 0.02822,-0.126327 0.02822,-0.138916 0,-0.01172 -0.0056,-0.01736 -0.01606,-0.01736 -0.01302,0 -0.03386,0.0074 -0.05643,0.02127 -0.02431,0.01346 -0.04254,0.02909 -0.05166,0.04298 -0.0069,0.01129 -0.01215,0.03082 -0.02127,0.07119 -0.01216,0.05513 -0.01954,0.0929 -0.02561,0.128498 -0.02952,0.0022 -0.0369,0.003 -0.06685,0.0069 0.01563,-0.05687 0.02692,-0.103753 0.0382,-0.156281 0.01129,-0.05123 0.01606,-0.07554 0.01606,-0.08899 0,-0.01736 -0.0056,-0.02561 -0.01693,-0.02561 -0.0061,0 -0.0191,0.003 -0.03733,0.0087 l -0.0013,-0.02084 c 0.03646,-0.01476 0.07553,-0.02518 0.09377,-0.02518 0.01693,0 0.02214,0.01 0.02214,0.04558 v 0.0061 c 0.0573,-0.03256 0.116342,-0.05166 0.157583,-0.05166 0.02474,0 0.03473,0.0061 0.03473,0.02127 0,0.01606 -0.0048,0.04081 -0.0204,0.102016 -0.0096,0.03473 -0.0178,0.07206 -0.0204,0.08856 -0.0048,0.02214 -0.0069,0.0356 -0.0069,0.04385 0,0.01172 0.0061,0.01736 0.0165,0.01736 0.0065,0 0.02127,-0.003 0.03907,-0.0096 l 0.0026,0.02214 c -0.04037,0.01432 -0.08595,0.02605 -0.102885,0.02605"
         style="fill:#211e1e;fill-opacity:1;fill-rule:nonzero;stroke:none;stroke-width:0.11113299"
         inkscape:connector-curvature="0" />
      <path
         id="path10325"
         d="m 94.053753,68.408363 c -0.02344,0 -0.03864,-0.01433 -0.03864,-0.03647 0,-0.02692 0.01953,-0.04602 0.04688,-0.04602 0.02257,0 0.0369,0.01346 0.0369,0.0356 0,0.02735 -0.0191,0.04688 -0.04515,0.04688 z m -0.08292,0.386795 c -0.01476,0 -0.02474,-0.0087 -0.02474,-0.02214 0,-0.0065 0.0022,-0.0191 0.0061,-0.0356 0.01,-0.03994 0.02344,-0.09464 0.03126,-0.123288 0.01042,-0.03907 0.01519,-0.06642 0.01519,-0.07727 0,-0.01 -0.0048,-0.01433 -0.01302,-0.01433 -0.0069,0 -0.01389,0.0022 -0.02952,0.0069 l -0.0052,0.0013 -0.0026,-0.02084 c 0.04168,-0.01606 0.08248,-0.02605 0.102885,-0.02605 0.01172,0 0.01606,0.0039 0.01606,0.01302 0,0.0091 -0.0039,0.03343 -0.01736,0.08639 l -0.01129,0.04471 c -0.0191,0.07337 -0.02344,0.09898 -0.02344,0.111133 0,0.01129 0.0061,0.01823 0.01736,0.01823 0.0069,0 0.0204,-0.0035 0.04167,-0.01085 l 0.0013,0.02127 c -0.03994,0.01606 -0.08291,0.02735 -0.104621,0.02735"
         style="fill:#211e1e;fill-opacity:1;fill-rule:nonzero;stroke:none;stroke-width:0.11113299"
         inkscape:connector-curvature="0" />
      <path
         id="path10327"
         d="m 94.351554,68.529914 -0.06295,-0.0013 -0.03169,0.154978 c -0.0082,0.04037 -0.0091,0.05166 -0.0091,0.05774 0,0.01042 0.0052,0.0165 0.01519,0.0165 0.0052,0 0.0165,-0.003 0.03473,-0.0082 l 0.0078,-0.0022 0.0022,0.02171 c -0.03951,0.01606 -0.08031,0.02648 -0.102017,0.02648 -0.01606,0 -0.02605,-0.0074 -0.02605,-0.02171 0,-0.01302 0.003,-0.03169 0.0091,-0.05557 0.0069,-0.02648 0.01216,-0.04819 0.01823,-0.07771 l 0.02344,-0.112001 -0.03994,8.67e-4 0.0052,-0.02431 c 0.05166,-0.0091 0.06902,-0.04992 0.08335,-0.09377 l 0.03647,-0.0078 -0.0191,0.08943 0.06251,-8.67e-4 -0.0074,0.03777"
         style="fill:#211e1e;fill-opacity:1;fill-rule:nonzero;stroke:none;stroke-width:0.11113299"
         inkscape:connector-curvature="0" />
      <path
         id="path10329"
         d="m 94.583806,68.437014 -0.02388,-0.01954 0.09203,-0.104621 0.06816,0.01693 z m -0.08378,0.228778 c -0.0056,0 -0.01216,0 -0.02214,-8.67e-4 -0.0022,0.01346 -0.003,0.02474 -0.003,0.03647 0,0.03864 0.01389,0.05904 0.03994,0.05904 0.02474,0 0.0547,-0.01302 0.09941,-0.04124 l 0.0082,0.02605 c -0.056,0.03473 -0.09854,0.05079 -0.137179,0.05079 -0.04645,0 -0.0725,-0.02822 -0.0725,-0.07901 0,-0.124591 0.08465,-0.233119 0.182328,-0.233119 0.04775,0 0.07597,0.02214 0.07597,0.05991 0,0.06946 -0.07423,0.121986 -0.17104,0.121986 z m 0.07771,-0.151506 c -0.03603,0 -0.07467,0.04992 -0.09377,0.123288 h 0.0074 c 0.07076,0 0.123723,-0.0369 0.123723,-0.08552 0,-0.02127 -0.01693,-0.03777 -0.03733,-0.03777"
         style="fill:#211e1e;fill-opacity:1;fill-rule:nonzero;stroke:none;stroke-width:0.11113299"
         inkscape:connector-curvature="0" />
      <path
         id="path10331"
         d="m 91.035798,68.654939 c 0.05079,0 0.0916,-0.04124 0.0916,-0.09203 0,-0.05036 -0.04081,-0.0916 -0.0916,-0.0916 -0.05036,0 -0.09203,0.04124 -0.09203,0.0916 0,0.05079 0.04167,0.09203 0.09203,0.09203"
         style="fill:#211e1e;fill-opacity:1;fill-rule:nonzero;stroke:none;stroke-width:0.11113299"
         inkscape:connector-curvature="0" />
      <path
         id="path10333"
         d="m 87.882833,68.654939 c 0.05036,0 0.0916,-0.04124 0.0916,-0.09203 0,-0.05036 -0.04124,-0.0916 -0.0916,-0.0916 -0.05079,0 -0.09203,0.04124 -0.09203,0.0916 0,0.05079 0.04124,0.09203 0.09203,0.09203"
         style="fill:#211e1e;fill-opacity:1;fill-rule:nonzero;stroke:none;stroke-width:0.11113299"
         inkscape:connector-curvature="0" />
      <path
         id="path10335"
         d="m 85.236044,69.129425 h 9.446739"
         style="fill:none;stroke:#211e1e;stroke-width:0.03600709;stroke-linecap:butt;stroke-linejoin:miter;stroke-miterlimit:4;stroke-opacity:1"
         inkscape:connector-curvature="0" />
      <path
         id="path10337"
         d="m 89.464308,67.560105 c -0.0069,0 -0.01433,-0.0074 -0.0069,-0.01432 0.02561,-0.01953 0.05166,-0.03907 0.07727,-0.05817 -0.0017,0 -0.003,4.34e-4 -0.0052,4.34e-4 -0.0069,0 -0.0069,-0.0074 -0.0069,-0.01433 -0.09377,-0.01476 -0.166265,0.05036 -0.231382,0.108094 -0.01433,0.0069 -0.02865,-0.0074 -0.03603,-0.0074 -0.108095,0.03603 -0.187103,0.1298 -0.295632,0.173211 0,-0.0069 0,-0.0069 0,-0.01433 -0.04341,0.01433 -0.08509,0.04037 -0.129799,0.05036 -0.06512,0.01433 -0.122854,0.0074 -0.180592,0.0074 -0.09768,0.0096 -0.195785,0.03256 -0.293895,0.0534 h 0.865622 c 0.09985,-0.11287 0.195785,-0.219228 0.32298,-0.31343 0.0074,-0.0069 0.0074,-0.02127 0.01476,-0.02865 -0.03603,0.01433 -0.05817,0.04341 -0.0942,0.05774"
         style="fill:#024ca1;fill-opacity:1;fill-rule:nonzero;stroke:none;stroke-width:0.11113299"
         inkscape:connector-curvature="0" />
      <path
         id="path10339"
         d="m 94.682783,67.84445 v -3.17033 h -3.389556 c 0.05296,0.02735 0.105055,0.06208 0.138048,0.115041 0.01432,0.02171 0.03603,0.06512 0.0217,0.09377 -0.01432,0.03647 -0.0217,0.0942 -0.05774,0.108528 -0.04341,0.02171 -0.101148,0.02171 -0.151505,0.01433 -0.02865,0 -0.05774,-0.0069 -0.08639,-0.01433 0.108094,0.04341 0.209243,0.09377 0.281306,0.194917 0.0069,0.01433 0.03603,0.02171 0.06512,0.02171 0.0069,0 0.0069,0.01433 0.0069,0.02127 -0.01432,0.01476 -0.02865,0.02171 -0.0217,0.04341 0.0074,0 0.01476,0 0.0217,0 0.03603,-0.01433 0.02909,-0.08639 0.07944,-0.06468 0.03603,0.02127 0.05036,0.07206 0.02909,0.108094 -0.02909,0.02865 -0.05817,0.05036 -0.08682,0.07206 -0.0074,0.01433 -0.0074,0.03603 0,0.05036 0.02171,0.02909 0.02865,0.05774 0.03603,0.08682 0.0217,0.05036 0.02908,0.108094 0.05079,0.158451 0.02865,0.108528 0.0573,0.216622 0.05036,0.324717 0,0.05774 -0.02909,0.108528 -0.0074,0.166265 0.01432,0.05774 0.05079,0.100714 0.07944,0.151506 0.02865,0.04298 0.05774,0.07206 0.07944,0.115474 0.04341,0.07206 0.12242,0.144125 0.08639,0.230948 -0.02171,0.05036 -0.101149,0.04298 -0.151506,0.07206 -0.04298,0.03603 -0.0069,0.09377 0.01433,0.1298 0.03603,0.06512 -0.04298,0.108094 -0.09377,0.129799 0.01433,0.02171 0.04341,0.01433 0.05079,0.02909 0.0069,0.03603 0.04298,0.05774 0.02171,0.09377 -0.02908,0.04298 -0.115474,0.06468 -0.0725,0.1298 0.02909,0.05036 0.01042,0.106358 -0.0069,0.158886 -0.0217,0.06468 -0.07944,0.09377 -0.129799,0.108094 -0.04341,0.01433 -0.0942,0.01433 -0.13718,0.0069 -0.01433,-0.0069 -0.02909,-0.01433 -0.04341,-0.01433 -0.122854,-0.01433 -0.245273,-0.05036 -0.368128,-0.05036 -0.03603,0.0074 -0.07206,0.01433 -0.100714,0.02865 -0.121986,0.08812 -0.19839,0.214886 -0.243103,0.349462 h 4.035517"
         style="fill:#eb1923;fill-opacity:1;fill-rule:nonzero;stroke:none;stroke-width:0.11113299"
         inkscape:connector-curvature="0" />
      <path
         id="path10341"
         d="m 91.395243,65.994259 c -0.04254,-0.01085 -0.07944,0 -0.12242,0 -0.05774,0.01433 -0.108528,0.02171 -0.158885,0.04341 0.04341,-0.02909 0.08639,-0.05774 0.136746,-0.0725 0.03646,-0.0069 0.0725,-0.02865 0.108528,-0.02865 0.04341,-0.0074 0.08639,-0.02171 0.122854,-0.0074 0.03603,0.01476 0.09333,0.01476 0.100714,0.03603 0.01476,0.04341 -0.0217,0.08682 -0.06468,0.115474 -0.0074,0.01476 0.02171,0.02214 0.02171,0.03647 -0.0074,0.01433 -0.02909,0.02171 -0.04341,0.02171 -0.01433,0.0069 -0.02909,0.02865 -0.04341,0.04298 0.01433,0 0,0.02171 0.01433,0.02171 -0.02865,0.03603 0.01476,0.108094 -0.02865,0.122854 -0.05036,0.01433 -0.108529,0.01433 -0.165832,0 0.02865,-0.0074 0.06468,0.0069 0.08639,-0.02171 0,-0.0074 0,-0.0217 0,-0.02908 0,-0.0069 -0.0074,-0.0069 -0.01433,-0.0069 -0.0074,0.0069 -0.01476,0.0069 -0.01476,0.0069 0,-0.01433 -0.01433,-0.02865 -0.02127,-0.02865 -0.04341,0.0074 -0.07944,-0.01432 -0.108528,-0.04341 0.0217,-0.0074 0.04341,-0.01433 0.06512,-0.0074 0.02171,0 0.01433,-0.03603 0.03603,-0.05036 0.0074,0 0.01433,0 0.0217,0 0.04341,-0.05774 0.1298,-0.07206 0.144126,-0.1298 0,-0.01433 -0.04298,-0.01433 -0.07206,-0.02171"
         style="fill:#919497;fill-opacity:1;fill-rule:nonzero;stroke:none;stroke-width:0.11113299"
         inkscape:connector-curvature="0" />
      <path
         id="path10343"
         d="m 89.158692,65.049194 c 0.02171,-0.08682 0.07901,-0.158885 0.136746,-0.230948 0.05774,-0.07033 0.143257,-0.106792 0.2227,-0.14456 h -4.282093 v 3.170764 h 2.160147 c 0.06382,-0.09377 0.196219,-0.08552 0.297802,-0.132839 0.03603,-0.01476 0.07901,0.0069 0.115474,0 0.02127,0 0.04298,0 0.06468,0.01433 -0.06859,0.03733 -0.131102,0.07944 -0.193615,0.118513 h 0.380284 c 0.04124,-0.01954 0.08248,-0.04732 0.123722,-0.06816 -0.05036,0.01476 -0.09377,0.03603 -0.13718,0.06512 -0.0074,0 -0.02865,0.0074 -0.02865,-0.0074 0.0069,-0.01432 0.02865,-0.0217 0.04298,-0.03603 0.0074,0 0.01432,0 0.01432,0.0074 0.230949,-0.180157 0.54872,-0.13718 0.815699,-0.230948 0.02171,-0.01433 0.04298,-0.02865 0.06468,-0.04341 0.03603,-0.01433 0.06512,-0.05036 0.108528,-0.07206 0.0573,-0.04341 0.100715,-0.09377 0.12242,-0.165831 0,-0.0074 -0.0069,-0.01476 -0.0069,-0.01476 -0.0942,0.101148 -0.202297,0.180591 -0.317771,0.238328 -0.151506,0.07944 -0.317337,0.06512 -0.476223,0.08639 0.0074,-0.01432 0.02171,-0.01432 0.03603,-0.01432 0,-0.02171 0.01433,-0.02865 0.02908,-0.04298 h 0.02171 c 0.0069,0 0.0069,-0.01476 0.01433,-0.01476 0.01433,0 0.03603,-0.0069 0.02865,-0.0069 -0.02127,-0.02909 -0.06468,0.0217 -0.100714,0 0.01433,-0.01433 0.0069,-0.03603 0.02127,-0.04341 h 0.02908 c 0,-0.01433 0.01433,-0.02909 0.01433,-0.02909 0.108528,-0.06468 0.209243,-0.115474 0.310391,-0.173211 -0.02171,0 -0.03603,0.0217 -0.05774,0.0074 0.01433,0 0,-0.02127 0.01433,-0.02127 0.07944,-0.02214 0.144559,-0.06512 0.223568,-0.0942 -0.02865,0 -0.05036,0.02171 -0.07901,0 0.01433,-0.0069 0.02171,-0.02171 0.04298,-0.02171 v -0.02127 c 0,-0.0074 0.0074,-0.0074 0.01476,-0.0074 -0.0074,0 -0.01476,-0.0074 -0.01476,-0.0074 0.0074,-0.01433 0.02909,-0.0069 0.04341,-0.02171 -0.0074,0 -0.02171,0 -0.02171,-0.0069 0.02171,-0.02909 0.05774,-0.03603 0.09377,-0.04341 -0.0069,-0.01432 -0.02865,0 -0.02865,-0.01432 0,-0.0074 0.0074,-0.0074 0.01433,-0.0074 -0.0069,0 -0.0069,0 -0.01433,0 -0.01433,-0.0069 -0.0074,-0.0217 -0.0074,-0.02865 0.04341,-0.05036 0.04341,-0.115474 0.06512,-0.173212 -0.0074,0 -0.01433,0 -0.01433,-0.0074 -0.0725,0.07944 -0.187971,0.108094 -0.296065,0.13718 h -0.03603 c -0.03603,0.01433 -0.08639,0.01433 -0.122854,-0.0069 -0.02865,-0.01476 -0.04341,-0.03647 -0.07206,-0.05817 -0.05774,-0.03603 -0.115474,-0.06468 -0.180591,-0.08639 -0.180157,-0.05774 -0.367694,-0.08639 -0.555231,-0.07944 0.07944,-0.04341 0.1667,-0.04689 0.252654,-0.07206 0.12242,-0.03603 0.237894,-0.07944 0.367694,-0.07206 -0.02171,-0.0074 -0.05036,0 -0.07206,0 -0.100714,-0.0074 -0.201863,0.02171 -0.310391,0.04298 -0.07206,0.01476 -0.136746,0.04341 -0.209243,0.05774 -0.04298,0.01476 -0.06468,0.05774 -0.115474,0.05079 0,0 0,-0.01433 0,-0.02171 0.0725,-0.08682 0.158886,-0.173211 0.27436,-0.180591 0.1298,-0.02127 0.252654,0 0.382454,0.01476 0.09377,0.0069 0.180157,0.02865 0.274359,0.05036 0.0356,0 0.04298,0.05774 0.07206,0.06468 0.04341,0.01476 0.08639,0 0.1298,0.02908 0,-0.01432 -0.0074,-0.02908 0,-0.04341 0.02865,-0.02865 0.06512,0.0074 0.09377,-0.0069 0.05774,-0.03603 -0.05036,-0.101148 -0.07944,-0.151505 0,-0.0074 0.0074,-0.01433 0.0074,-0.01433 0.05774,0.05036 0.100714,0.108094 0.173211,0.144125 0.03603,0.01433 0.12242,0.03603 0.108094,-0.0074 -0.03603,-0.07944 -0.108094,-0.144125 -0.165831,-0.216188 v -0.02909 c -0.01476,0 -0.01476,-0.0074 -0.02171,-0.01433 v -0.02908 c -0.02909,-0.01433 -0.02171,-0.04298 -0.03603,-0.06468 -0.02171,-0.03603 -0.0074,-0.08682 -0.02171,-0.1298 -0.01433,-0.04341 -0.02171,-0.07944 -0.02909,-0.122854 -0.02127,-0.122854 -0.05036,-0.230948 -0.06468,-0.346422 -0.01476,-0.13718 0.07944,-0.245274 0.144126,-0.367694 0.05079,-0.08682 0.108528,-0.173212 0.202297,-0.230949 z m -1.169935,2.405856 c -0.01433,0 -0.04341,0.0074 -0.03603,-0.0074 0.0069,-0.0356 0.05774,-0.0356 0.08639,-0.05036 0.01433,-0.0069 0.03603,-0.0217 0.05036,-0.01432 0.01476,0.0217 0.03603,0.01432 0.05036,0.02908 -0.04298,0.04298 -0.100714,0.02127 -0.151071,0.04298 z m -0.230514,-0.720194 c 0.0074,0 0.02171,0 0.02171,0.0074 0,0.03603 -0.02171,0.06468 -0.05774,0.07206 0.05774,0.01433 0.115474,0.01433 0.172777,0.04298 -0.0069,0.01433 -0.02127,0.0074 -0.02865,0.0074 0.03603,0.02127 0.07901,0.0069 0.11504,0.03603 -0.02171,0.02127 -0.04298,0 -0.06468,0 0.223134,0.06468 0.461028,0.11504 0.648131,0.259166 -0.158451,0.07901 -0.323849,0.11504 -0.496626,0.151071 -0.02171,0 -0.03603,0 -0.05774,-0.0069 0,0.0069 0,0.02127 -0.0074,0.02127 -0.02865,0 -0.05036,0 -0.07206,0.01476 -0.02865,0.01433 -0.07163,0.0217 -0.09333,0 -0.0074,-0.0074 0.02171,0 0.02865,-0.01476 h -0.05774 c -0.0069,0 -0.0069,-0.0069 -0.0069,-0.01433 -0.03603,0.0074 -0.07944,0.02171 -0.115475,0.02909 -0.05036,0.01433 -0.09333,0.05036 -0.151071,0.06468 -0.07901,0.02865 -0.144126,0.09377 -0.230514,0.12242 -0.0074,0 -0.0074,-0.0074 -0.0074,-0.01433 0.0074,-0.02171 0.03603,-0.02909 0.05079,-0.05036 0,-0.0074 0,-0.01476 -0.0074,-0.01476 0.05774,-0.07901 0.136746,-0.12242 0.208809,-0.187103 v -0.02171 c 0.02171,-0.02865 0.05774,-0.04298 0.07206,-0.07901 0.0074,-0.02171 0.03603,-0.05036 0.07206,-0.06468 -0.0074,-0.0074 -0.0217,-0.0074 -0.0217,-0.02171 -0.02865,0 -0.05774,0.01433 -0.08639,-0.0074 0.01433,-0.01389 0.03082,-0.0204 0.04775,-0.02518 -0.0074,-8.67e-4 -0.01389,-0.0039 -0.0191,-0.01085 -0.0069,-0.01433 0.01433,-0.03039 0.03603,-0.03603 0.02909,-0.0069 0.06512,-0.0069 0.08639,-0.02865 -0.05036,-0.0069 -0.10766,0.01433 -0.158452,-0.01432 0.03603,-0.09377 0.09377,-0.172778 0.180157,-0.216189 z m -0.338175,0.136746 c 0.0069,-0.02865 0.02865,-0.0573 0.0573,-0.06468 0.0074,0 0.0074,0.0074 0.0074,0.01433 -0.0074,0.01432 -0.0152,0.01606 -0.02171,0.02908 -0.0069,0.01433 -0.01433,0.02127 -0.02865,0.02865 -0.0074,0 -0.01433,0 -0.01433,-0.0074 z m 0.439323,-0.424563 c -0.0074,0 -0.01476,0 -0.02171,-0.0074 0.0069,-0.0074 0.0069,-0.01433 0.0069,-0.02171 -0.07206,0.07944 -0.172777,0.115475 -0.230514,0.208809 -0.04298,0.07206 -0.07206,0.165831 -0.165397,0.187537 -0.02865,0.0069 0.0074,-0.02171 -0.0074,-0.01476 -0.223134,0.13718 -0.381585,0.302577 -0.554362,0.49706 0,0 -0.0074,-0.0074 -0.0074,-0.01433 0.09377,-0.12242 0.165831,-0.237894 0.230514,-0.36726 0.09377,-0.05036 0.171474,-0.123722 0.24484,-0.201428 0.12242,-0.1298 0.252219,-0.245274 0.403291,-0.317337 0.05774,-0.02127 0.1298,-0.01433 0.187103,0.0074 -0.02127,0.02865 -0.0573,0.02171 -0.08595,0.04341"
         style="fill:#024ca1;fill-opacity:1;fill-rule:nonzero;stroke:none;stroke-width:0.11113299"
         inkscape:connector-curvature="0" />
    </g>
  </g>
</svg>
