<?xml version="1.0" encoding="UTF-8" standalone="no"?>
<svg
   xmlns:dc="http://purl.org/dc/elements/1.1/"
   xmlns:cc="http://creativecommons.org/ns#"
   xmlns:rdf="http://www.w3.org/1999/02/22-rdf-syntax-ns#"
   xmlns:svg="http://www.w3.org/2000/svg"
   xmlns="http://www.w3.org/2000/svg"
   xmlns:sodipodi="http://sodipodi.sourceforge.net/DTD/sodipodi-0.dtd"
   xmlns:inkscape="http://www.inkscape.org/namespaces/inkscape"
   inkscape:export-ydpi="1001.7877"
   inkscape:export-xdpi="1001.7877"
   inkscape:export-filename="C:\Sources\SCNGE\Workspace\layout\src\assets\guichet-partenaires\images\logo\long-base.png"
   sodipodi:docname="long-base.svg"
   inkscape:version="1.0 (4035a4fb49, 2020-05-01)"
   id="svg4817"
   version="1.1"
   viewBox="0 0 70.004257 12.983899"
   height="12.983899mm"
   width="70.004257mm">
  <defs
     id="defs4811" />
  <sodipodi:namedview
     inkscape:window-maximized="1"
     inkscape:window-y="-8"
     inkscape:window-x="-8"
     inkscape:window-height="1017"
     inkscape:window-width="1920"
     showgrid="false"
     inkscape:document-rotation="0"
     inkscape:current-layer="g4923"
     inkscape:document-units="mm"
     inkscape:cy="41.889775"
     inkscape:cx="121.58948"
     inkscape:zoom="5.6"
     inkscape:pageshadow="2"
     inkscape:pageopacity="0.0"
     borderopacity="1.0"
     bordercolor="#666666"
     pagecolor="#ffffff"
     id="base" />
  <metadata
     id="metadata4814">
    <rdf:RDF>
      <cc:Work
         rdf:about="">
        <dc:format>image/svg+xml</dc:format>
        <dc:type
           rdf:resource="http://purl.org/dc/dcmitype/StillImage" />
        <dc:title></dc:title>
      </cc:Work>
    </rdf:RDF>
  </metadata>
  <g
     transform="translate(-70.831207,-140.98311)"
     id="layer1"
     inkscape:groupmode="layer"
     inkscape:label="Calque 1">
    <rect
       style="color:#000000;clip-rule:nonzero;display:inline;overflow:visible;visibility:visible;isolation:auto;mix-blend-mode:normal;color-interpolation:sRGB;color-interpolation-filters:linearRGB;solid-color:#000000;solid-opacity:1;fill:none;fill-opacity:1;fill-rule:nonzero;stroke:none;stroke-width:0.265177;stroke-linecap:square;stroke-linejoin:miter;stroke-miterlimit:4;stroke-dasharray:none;stroke-dashoffset:0.999213;stroke-opacity:1;color-rendering:auto;image-rendering:auto;shape-rendering:auto;text-rendering:auto;enable-background:accumulate"
       id="rect7848-8-9-4"
       width="70.004257"
       height="12.983899"
       x="70.831207"
       y="140.98311" />
    <g
       style="fill:#333333"
       id="g4923">
      <path
         d="m 83.865257,148.1886 h 0.623748 v -2.40767 h -1.871244 v 0.72979 h 0.985522 c -0.05614,0.61751 -0.424149,0.96057 -1.060372,0.96057 -0.879485,0 -1.210071,-0.7485 -1.210071,-1.49076 0,-0.77968 0.330586,-1.52818 1.210071,-1.52818 0.461574,0 0.829585,0.25573 0.94186,0.7485 h 0.935622 c -0.106037,-1.01048 -0.96681,-1.57185 -1.877482,-1.57185 -1.378483,0 -2.189355,1.02918 -2.189355,2.35153 0,1.28492 0.810872,2.31411 2.189355,2.31411 0.430386,0 0.879485,-0.16842 1.222546,-0.61128 z"
         style="font-style:normal;font-variant:normal;font-weight:bold;font-stretch:normal;font-size:6.23748px;line-height:125%;font-family:'Helvetica Neue';-inkscape-font-specification:'Helvetica Neue Bold';letter-spacing:-0.358654px;word-spacing:0px;fill:#0092bc;fill-opacity:1;stroke:none;stroke-width:0.155937px;stroke-linecap:butt;stroke-linejoin:miter;stroke-opacity:1"
         id="path5764" />
      <path
         d="M 87.858902,144.96382 H 86.97318 v 1.69036 c 0,0.65493 -0.205837,0.92315 -0.686123,0.92315 -0.411673,0 -0.56761,-0.26198 -0.56761,-0.79216 v -1.82135 h -0.885723 v 1.98352 c 0,0.7984 0.237025,1.32858 1.178884,1.32858 0.374249,0 0.760973,-0.17465 0.985522,-0.53642 h 0.01871 v 0.4491 h 0.842059 z"
         style="font-style:normal;font-variant:normal;font-weight:bold;font-stretch:normal;font-size:6.23748px;line-height:125%;font-family:'Helvetica Neue';-inkscape-font-specification:'Helvetica Neue Bold';letter-spacing:-0.358654px;word-spacing:0px;fill:#0092bc;fill-opacity:1;stroke:none;stroke-width:0.155937px;stroke-linecap:butt;stroke-linejoin:miter;stroke-opacity:1"
         id="path5766" />
      <path
         d="m 88.203524,148.1886 h 0.885723 v -3.22478 h -0.885723 z m 0.885723,-4.45356 h -0.885723 v 0.72978 h 0.885723 z"
         style="font-style:normal;font-variant:normal;font-weight:bold;font-stretch:normal;font-size:6.23748px;line-height:125%;font-family:'Helvetica Neue';-inkscape-font-specification:'Helvetica Neue Bold';letter-spacing:-0.358654px;word-spacing:0px;fill:#0092bc;fill-opacity:1;stroke:none;stroke-width:0.155937px;stroke-linecap:butt;stroke-linejoin:miter;stroke-opacity:1"
         id="path5768" />
      <path
         d="m 92.490624,146.09904 c -0.05614,-0.82334 -0.754735,-1.22254 -1.515708,-1.22254 -1.047897,0 -1.646695,0.74226 -1.646695,1.74649 0,0.96681 0.654936,1.65293 1.627983,1.65293 0.848297,0 1.440858,-0.46781 1.553132,-1.32234 h -0.854535 c -0.05614,0.39296 -0.293161,0.65493 -0.704835,0.65493 -0.555136,0 -0.736023,-0.55513 -0.736023,-1.01671 0,-0.47404 0.187125,-1.04789 0.754736,-1.04789 0.368011,0 0.598798,0.19336 0.654935,0.55513 z"
         style="font-style:normal;font-variant:normal;font-weight:bold;font-stretch:normal;font-size:6.23748px;line-height:125%;font-family:'Helvetica Neue';-inkscape-font-specification:'Helvetica Neue Bold';letter-spacing:-0.358654px;word-spacing:0px;fill:#0092bc;fill-opacity:1;stroke:none;stroke-width:0.155937px;stroke-linecap:butt;stroke-linejoin:miter;stroke-opacity:1"
         id="path5770" />
      <path
         d="m 92.651045,148.1886 h 0.885722 v -1.69036 c 0,-0.65493 0.205837,-0.92315 0.686123,-0.92315 0.411674,0 0.567611,0.26198 0.567611,0.79216 v 1.82135 h 0.885722 v -1.98352 c 0,-0.7984 -0.237024,-1.32858 -1.178884,-1.32858 -0.330586,0 -0.71731,0.17465 -0.941859,0.53642 h -0.01871 v -1.67788 h -0.885722 z"
         style="font-style:normal;font-variant:normal;font-weight:bold;font-stretch:normal;font-size:6.23748px;line-height:125%;font-family:'Helvetica Neue';-inkscape-font-specification:'Helvetica Neue Bold';letter-spacing:-0.358654px;word-spacing:0px;fill:#0092bc;fill-opacity:1;stroke:none;stroke-width:0.155937px;stroke-linecap:butt;stroke-linejoin:miter;stroke-opacity:1"
         id="path5772" />
      <path
         d="m 99.05226,146.7914 c 0.06238,-0.99176 -0.467811,-1.9149 -1.565607,-1.9149 -0.979285,0 -1.646695,0.73602 -1.646695,1.70283 0,0.998 0.629985,1.69659 1.646695,1.69659 0.729785,0 1.259971,-0.32435 1.50947,-1.08532 h -0.779685 c -0.05614,0.1996 -0.343062,0.41791 -0.698598,0.41791 -0.492761,0 -0.76721,-0.25573 -0.79216,-0.81711 z m -2.32658,-0.56137 c 0.01248,-0.2495 0.17465,-0.68612 0.736023,-0.68612 0.430386,0 0.623748,0.23702 0.704835,0.68612 z"
         style="font-style:normal;font-variant:normal;font-weight:bold;font-stretch:normal;font-size:6.23748px;line-height:125%;font-family:'Helvetica Neue';-inkscape-font-specification:'Helvetica Neue Bold';letter-spacing:-0.358654px;word-spacing:0px;fill:#0092bc;fill-opacity:1;stroke:none;stroke-width:0.155937px;stroke-linecap:butt;stroke-linejoin:miter;stroke-opacity:1"
         id="path5774" />
      <path
         d="m 100.34167,143.99701 h -0.885726 v 0.96681 H 98.91952 v 0.59256 h 0.536424 v 1.90243 c 0,0.64246 0.474048,0.76721 1.016706,0.76721 0.17465,0 0.36801,-0.006 0.51771,-0.0312 v -0.69236 c -0.0936,0.0187 -0.18088,0.025 -0.27445,0.025 -0.29939,0 -0.37424,-0.0748 -0.37424,-0.37425 v -1.5968 h 0.64869 v -0.59256 h -0.64869 z"
         style="font-style:normal;font-variant:normal;font-weight:bold;font-stretch:normal;font-size:6.23748px;line-height:125%;font-family:'Helvetica Neue';-inkscape-font-specification:'Helvetica Neue Bold';letter-spacing:-0.358654px;word-spacing:0px;fill:#0092bc;fill-opacity:1;stroke:none;stroke-width:0.155937px;stroke-linecap:butt;stroke-linejoin:miter;stroke-opacity:1"
         id="path5776" />
      <path
         d="m 101.04689,146.86625 h 1.87748 v -0.76097 h -1.87748 z"
         style="font-style:normal;font-variant:normal;font-weight:bold;font-stretch:normal;font-size:6.23748px;line-height:125%;font-family:'Helvetica Neue';-inkscape-font-specification:'Helvetica Neue Bold';letter-spacing:-0.358654px;word-spacing:0px;fill:#0092bc;fill-opacity:1;stroke:none;stroke-width:0.155937px;stroke-linecap:butt;stroke-linejoin:miter;stroke-opacity:1"
         id="path5778" />
      <path
         d="m 103.22845,149.32382 h 0.88572 v -1.53442 h 0.0125 c 0.21207,0.31811 0.58008,0.48652 0.96681,0.48652 0.94186,0 1.41591,-0.80463 1.41591,-1.6654 0,-0.91691 -0.45534,-1.73402 -1.46581,-1.73402 -0.3992,0 -0.7485,0.15593 -0.96057,0.499 h -0.0125 v -0.41168 h -0.84206 z m 1.62798,-1.71531 c -0.57384,0 -0.77344,-0.499 -0.77344,-1.02294 0,-0.52395 0.18712,-1.04166 0.76721,-1.04166 0.56761,0 0.77344,0.53018 0.77344,1.04166 0,0.52394 -0.18712,1.02294 -0.76721,1.02294 z"
         style="font-style:normal;font-variant:normal;font-weight:bold;font-stretch:normal;font-size:6.23748px;line-height:125%;font-family:'Helvetica Neue';-inkscape-font-specification:'Helvetica Neue Bold';letter-spacing:-0.358654px;word-spacing:0px;fill:#e53138;fill-opacity:1;stroke:none;stroke-width:0.155937px;stroke-linecap:butt;stroke-linejoin:miter;stroke-opacity:1"
         id="path5780" />
      <path
         d="m 108.69141,146.9411 c 0,0.19336 -0.025,0.74226 -0.71731,0.74226 -0.28692,0 -0.54266,-0.0811 -0.54266,-0.41167 0,-0.32435 0.2495,-0.41791 0.52395,-0.47405 0.27445,-0.0499 0.58632,-0.0561 0.73602,-0.18712 z m -1.16017,-0.98552 c 0.0312,-0.3493 0.2495,-0.48652 0.58633,-0.48652 0.31187,0 0.57384,0.0561 0.57384,0.43662 0,0.36177 -0.50523,0.34306 -1.04789,0.42415 -0.5489,0.0749 -1.0978,0.2495 -1.0978,0.97928 0,0.66118 0.48652,0.96681 1.0978,0.96681 0.39296,0 0.80463,-0.10603 1.08532,-0.3992 0.006,0.10604 0.0312,0.21208 0.0624,0.31188 h 0.8982 c -0.0811,-0.13099 -0.11227,-0.42415 -0.11227,-0.71731 v -1.67788 c 0,-0.77345 -0.77345,-0.91691 -1.41591,-0.91691 -0.72355,0 -1.46581,0.2495 -1.51571,1.07908 z"
         style="font-style:normal;font-variant:normal;font-weight:bold;font-stretch:normal;font-size:6.23748px;line-height:125%;font-family:'Helvetica Neue';-inkscape-font-specification:'Helvetica Neue Bold';letter-spacing:-0.358654px;word-spacing:0px;fill:#e53138;fill-opacity:1;stroke:none;stroke-width:0.155937px;stroke-linecap:butt;stroke-linejoin:miter;stroke-opacity:1"
         id="path5782" />
      <path
         d="m 109.90597,148.1886 h 0.88572 v -1.45333 c 0,-0.56761 0.22455,-1.03543 0.87325,-1.03543 0.10604,0 0.23702,0.0125 0.31811,0.0312 v -0.82335 c -0.0561,-0.0187 -0.13099,-0.0312 -0.19336,-0.0312 -0.43039,0 -0.86701,0.28068 -1.02919,0.68612 h -0.0125 v -0.5988 h -0.84206 z"
         style="font-style:normal;font-variant:normal;font-weight:bold;font-stretch:normal;font-size:6.23748px;line-height:125%;font-family:'Helvetica Neue';-inkscape-font-specification:'Helvetica Neue Bold';letter-spacing:-0.358654px;word-spacing:0px;fill:#e53138;fill-opacity:1;stroke:none;stroke-width:0.155937px;stroke-linecap:butt;stroke-linejoin:miter;stroke-opacity:1"
         id="path5784" />
      <path
         d="m 113.0944,143.99701 h -0.88573 v 0.96681 h -0.53642 v 0.59256 h 0.53642 v 1.90243 c 0,0.64246 0.47405,0.76721 1.01671,0.76721 0.17465,0 0.36801,-0.006 0.51771,-0.0312 v -0.69236 c -0.0936,0.0187 -0.18088,0.025 -0.27445,0.025 -0.2994,0 -0.37424,-0.0748 -0.37424,-0.37425 v -1.5968 h 0.64869 v -0.59256 h -0.64869 z"
         style="font-style:normal;font-variant:normal;font-weight:bold;font-stretch:normal;font-size:6.23748px;line-height:125%;font-family:'Helvetica Neue';-inkscape-font-specification:'Helvetica Neue Bold';letter-spacing:-0.358654px;word-spacing:0px;fill:#e53138;fill-opacity:1;stroke:none;stroke-width:0.155937px;stroke-linecap:butt;stroke-linejoin:miter;stroke-opacity:1"
         id="path5786" />
      <path
         d="m 116.86222,146.7914 c 0.0624,-0.99176 -0.46781,-1.9149 -1.56561,-1.9149 -0.97928,0 -1.64669,0.73602 -1.64669,1.70283 0,0.998 0.62998,1.69659 1.64669,1.69659 0.72979,0 1.25997,-0.32435 1.50947,-1.08532 h -0.77968 c -0.0561,0.1996 -0.34306,0.41791 -0.6986,0.41791 -0.49276,0 -0.76721,-0.25573 -0.79216,-0.81711 z m -2.32658,-0.56137 c 0.0125,-0.2495 0.17465,-0.68612 0.73602,-0.68612 0.43039,0 0.62375,0.23702 0.70484,0.68612 z"
         style="font-style:normal;font-variant:normal;font-weight:bold;font-stretch:normal;font-size:6.23748px;line-height:125%;font-family:'Helvetica Neue';-inkscape-font-specification:'Helvetica Neue Bold';letter-spacing:-0.358654px;word-spacing:0px;fill:#e53138;fill-opacity:1;stroke:none;stroke-width:0.155937px;stroke-linecap:butt;stroke-linejoin:miter;stroke-opacity:1"
         id="path5788" />
      <path
         d="m 117.02888,148.1886 h 0.88572 v -1.69036 c 0,-0.65493 0.20584,-0.92315 0.68613,-0.92315 0.41167,0 0.56761,0.26198 0.56761,0.79216 v 1.82135 h 0.88572 v -1.98352 c 0,-0.7984 -0.23702,-1.32858 -1.17888,-1.32858 -0.37425,0 -0.76098,0.17465 -0.98553,0.53642 h -0.0187 v -0.4491 h -0.84206 z"
         style="font-style:normal;font-variant:normal;font-weight:bold;font-stretch:normal;font-size:6.23748px;line-height:125%;font-family:'Helvetica Neue';-inkscape-font-specification:'Helvetica Neue Bold';letter-spacing:-0.358654px;word-spacing:0px;fill:#e53138;fill-opacity:1;stroke:none;stroke-width:0.155937px;stroke-linecap:butt;stroke-linejoin:miter;stroke-opacity:1"
         id="path5790" />
      <path
         d="m 122.3822,146.9411 c 0,0.19336 -0.025,0.74226 -0.71731,0.74226 -0.28692,0 -0.54266,-0.0811 -0.54266,-0.41167 0,-0.32435 0.2495,-0.41791 0.52395,-0.47405 0.27445,-0.0499 0.58632,-0.0561 0.73602,-0.18712 z m -1.16017,-0.98552 c 0.0312,-0.3493 0.2495,-0.48652 0.58632,-0.48652 0.31188,0 0.57385,0.0561 0.57385,0.43662 0,0.36177 -0.50524,0.34306 -1.0479,0.42415 -0.5489,0.0749 -1.09779,0.2495 -1.09779,0.97928 0,0.66118 0.48652,0.96681 1.09779,0.96681 0.39296,0 0.80464,-0.10603 1.08532,-0.3992 0.006,0.10604 0.0312,0.21208 0.0624,0.31188 h 0.8982 c -0.0811,-0.13099 -0.11228,-0.42415 -0.11228,-0.71731 v -1.67788 c 0,-0.77345 -0.77345,-0.91691 -1.41591,-0.91691 -0.72354,0 -1.4658,0.2495 -1.5157,1.07908 z"
         style="font-style:normal;font-variant:normal;font-weight:bold;font-stretch:normal;font-size:6.23748px;line-height:125%;font-family:'Helvetica Neue';-inkscape-font-specification:'Helvetica Neue Bold';letter-spacing:-0.358654px;word-spacing:0px;fill:#e53138;fill-opacity:1;stroke:none;stroke-width:0.155937px;stroke-linecap:butt;stroke-linejoin:miter;stroke-opacity:1"
         id="path5792" />
      <path
         d="m 123.62171,148.1886 h 0.88572 v -3.22478 h -0.88572 z m 0.88572,-4.45356 h -0.88572 v 0.72978 h 0.88572 z"
         style="font-style:normal;font-variant:normal;font-weight:bold;font-stretch:normal;font-size:6.23748px;line-height:125%;font-family:'Helvetica Neue';-inkscape-font-specification:'Helvetica Neue Bold';letter-spacing:-0.358654px;word-spacing:0px;fill:#e53138;fill-opacity:1;stroke:none;stroke-width:0.155937px;stroke-linecap:butt;stroke-linejoin:miter;stroke-opacity:1"
         id="path5794" />
      <path
         d="m 124.8462,148.1886 h 0.88573 v -1.45333 c 0,-0.56761 0.22455,-1.03543 0.87324,-1.03543 0.10604,0 0.23703,0.0125 0.31812,0.0312 v -0.82335 c -0.0561,-0.0187 -0.13099,-0.0312 -0.19337,-0.0312 -0.43038,0 -0.86701,0.28068 -1.02918,0.68612 h -0.0125 v -0.5988 h -0.84206 z"
         style="font-style:normal;font-variant:normal;font-weight:bold;font-stretch:normal;font-size:6.23748px;line-height:125%;font-family:'Helvetica Neue';-inkscape-font-specification:'Helvetica Neue Bold';letter-spacing:-0.358654px;word-spacing:0px;fill:#e53138;fill-opacity:1;stroke:none;stroke-width:0.155937px;stroke-linecap:butt;stroke-linejoin:miter;stroke-opacity:1"
         id="path5796" />
      <path
         d="m 129.85861,146.7914 c 0.0624,-0.99176 -0.46782,-1.9149 -1.56561,-1.9149 -0.97929,0 -1.6467,0.73602 -1.6467,1.70283 0,0.998 0.62999,1.69659 1.6467,1.69659 0.72978,0 1.25997,-0.32435 1.50947,-1.08532 h -0.77969 c -0.0561,0.1996 -0.34306,0.41791 -0.69859,0.41791 -0.49277,0 -0.76722,-0.25573 -0.79216,-0.81711 z m -2.32658,-0.56137 c 0.0125,-0.2495 0.17464,-0.68612 0.73602,-0.68612 0.43038,0 0.62375,0.23702 0.70483,0.68612 z"
         style="font-style:normal;font-variant:normal;font-weight:bold;font-stretch:normal;font-size:6.23748px;line-height:125%;font-family:'Helvetica Neue';-inkscape-font-specification:'Helvetica Neue Bold';letter-spacing:-0.358654px;word-spacing:0px;fill:#e53138;fill-opacity:1;stroke:none;stroke-width:0.155937px;stroke-linecap:butt;stroke-linejoin:miter;stroke-opacity:1"
         id="path5798" />
      <path
         d="m 129.86933,147.1407 c 0.0374,0.85454 0.76721,1.13522 1.5157,1.13522 0.73603,0 1.47205,-0.27445 1.47205,-1.12274 0,-0.5988 -0.50524,-0.78593 -1.02295,-0.90444 -0.50523,-0.11851 -1.00423,-0.16217 -1.00423,-0.48028 0,-0.26198 0.29316,-0.2994 0.49276,-0.2994 0.31811,0 0.58008,0.0936 0.60503,0.43662 h 0.84206 c -0.0686,-0.79216 -0.71731,-1.02918 -1.42214,-1.02918 -0.69236,0 -1.40343,0.21207 -1.40343,1.03542 0,0.56761 0.51147,0.7485 1.02294,0.86077 0.63622,0.13723 1.00424,0.23079 1.00424,0.499 0,0.31187 -0.32435,0.41167 -0.58009,0.41167 -0.3493,0 -0.67365,-0.15593 -0.67988,-0.54266 z"
         style="font-style:normal;font-variant:normal;font-weight:bold;font-stretch:normal;font-size:6.23748px;line-height:125%;font-family:'Helvetica Neue';-inkscape-font-specification:'Helvetica Neue Bold';letter-spacing:-0.358654px;word-spacing:0px;fill:#e53138;fill-opacity:1;stroke:none;stroke-width:0.155937px;stroke-linecap:butt;stroke-linejoin:miter;stroke-opacity:1"
         id="path5800" />
      <path
         d="m 133.05424,148.1886 h 0.97929 v -0.96057 h -0.97929 z"
         style="font-style:normal;font-variant:normal;font-weight:bold;font-stretch:normal;font-size:6.23748px;line-height:125%;font-family:'Helvetica Neue';-inkscape-font-specification:'Helvetica Neue Bold';letter-spacing:-0.358654px;word-spacing:0px;fill:#0092bc;fill-opacity:1;stroke:none;stroke-width:0.155937px;stroke-linecap:butt;stroke-linejoin:miter;stroke-opacity:1"
         id="path5802" />
      <path
         d="m 134.58145,148.1886 h 0.88572 v -2.63222 h 0.61128 v -0.59256 h -0.61128 v -0.19336 c 0,-0.26821 0.0998,-0.36801 0.33683,-0.36801 0.11227,0 0.21831,0.006 0.32435,0.0187 v -0.66117 c -0.1497,-0.006 -0.31188,-0.0249 -0.46781,-0.0249 -0.72355,0 -1.07909,0.41167 -1.07909,0.97928 v 0.2495 h -0.53018 v 0.59256 h 0.53018 z"
         style="font-style:normal;font-variant:normal;font-weight:bold;font-stretch:normal;font-size:6.23748px;line-height:125%;font-family:'Helvetica Neue';-inkscape-font-specification:'Helvetica Neue Bold';letter-spacing:-0.358654px;word-spacing:0px;fill:#0092bc;fill-opacity:1;stroke:none;stroke-width:0.155937px;stroke-linecap:butt;stroke-linejoin:miter;stroke-opacity:1"
         id="path5804" />
      <path
         d="m 136.11266,148.1886 h 0.88572 v -1.45333 c 0,-0.56761 0.22455,-1.03543 0.87325,-1.03543 0.10603,0 0.23702,0.0125 0.31811,0.0312 v -0.82335 c -0.0561,-0.0187 -0.13099,-0.0312 -0.19336,-0.0312 -0.43039,0 -0.86701,0.28068 -1.02919,0.68612 h -0.0125 v -0.5988 h -0.84206 z"
         style="font-style:normal;font-variant:normal;font-weight:bold;font-stretch:normal;font-size:6.23748px;line-height:125%;font-family:'Helvetica Neue';-inkscape-font-specification:'Helvetica Neue Bold';letter-spacing:-0.358654px;word-spacing:0px;fill:#0092bc;fill-opacity:1;stroke:none;stroke-width:0.155937px;stroke-linecap:butt;stroke-linejoin:miter;stroke-opacity:1"
         id="path5806" />
      <g
         inkscape:export-ydpi="1001"
         inkscape:export-xdpi="1001"
         style="fill:#0092bc;fill-opacity:1"
         transform="matrix(0.28222223,0,0,0.28222223,-457.90688,81.711882)"
         id="g9568">
        <path
           inkscape:connector-curvature="0"
           id="rect11068-9-9-7-3-4-9-48-6-4"
           d="m 1882.8563,230.16762 v 4.40347 h 4.9671 v 4.96718 h 4.4035 v -9.37065 z"
           style="color:#000000;clip-rule:nonzero;display:inline;overflow:visible;visibility:visible;opacity:1;isolation:auto;mix-blend-mode:normal;color-interpolation:sRGB;color-interpolation-filters:linearRGB;solid-color:#000000;solid-opacity:1;fill:#0092bc;fill-opacity:1;fill-rule:nonzero;stroke:none;stroke-width:0.566238;stroke-linecap:square;stroke-linejoin:miter;stroke-miterlimit:4;stroke-dasharray:none;stroke-dashoffset:0.999213;stroke-opacity:1;color-rendering:auto;image-rendering:auto;shape-rendering:auto;text-rendering:auto;enable-background:accumulate" />
        <path
           inkscape:connector-curvature="0"
           id="rect11068-6-6-5-4-7-5-9-0-9-9"
           d="m 1893.6325,239.53827 h 4.4035 v -4.96718 h 4.9672 v -4.40347 h -9.3707 z"
           style="color:#000000;clip-rule:nonzero;display:inline;overflow:visible;visibility:visible;opacity:1;isolation:auto;mix-blend-mode:normal;color-interpolation:sRGB;color-interpolation-filters:linearRGB;solid-color:#000000;solid-opacity:1;fill:#0092bc;fill-opacity:1;fill-rule:nonzero;stroke:none;stroke-width:0.566238;stroke-linecap:square;stroke-linejoin:miter;stroke-miterlimit:4;stroke-dasharray:none;stroke-dashoffset:0.999213;stroke-opacity:1;color-rendering:auto;image-rendering:auto;shape-rendering:auto;text-rendering:auto;enable-background:accumulate" />
        <path
           inkscape:connector-curvature="0"
           id="rect11068-6-7-8-4-9-1-8-66-9-0-1"
           d="m 1892.2269,219.39136 h -4.4035 v 4.96718 h -4.9671 v 4.40348 h 9.3706 z"
           style="color:#000000;clip-rule:nonzero;display:inline;overflow:visible;visibility:visible;opacity:1;isolation:auto;mix-blend-mode:normal;color-interpolation:sRGB;color-interpolation-filters:linearRGB;solid-color:#000000;solid-opacity:1;fill:#0092bc;fill-opacity:1;fill-rule:nonzero;stroke:none;stroke-width:0.566238;stroke-linecap:square;stroke-linejoin:miter;stroke-miterlimit:4;stroke-dasharray:none;stroke-dashoffset:0.999213;stroke-opacity:1;color-rendering:auto;image-rendering:auto;shape-rendering:auto;text-rendering:auto;enable-background:accumulate" />
        <path
           inkscape:connector-curvature="0"
           id="rect11068-1-2-0-9-1-5-7-2-0-5"
           d="m 1903.0032,228.76202 v -4.40348 h -4.9672 v -4.96718 h -4.4035 v 9.37066 z"
           style="color:#000000;clip-rule:nonzero;display:inline;overflow:visible;visibility:visible;opacity:1;isolation:auto;mix-blend-mode:normal;color-interpolation:sRGB;color-interpolation-filters:linearRGB;solid-color:#000000;solid-opacity:1;fill:#0092bc;fill-opacity:1;fill-rule:nonzero;stroke:none;stroke-width:0.566238;stroke-linecap:square;stroke-linejoin:miter;stroke-miterlimit:4;stroke-dasharray:none;stroke-dashoffset:0.999213;stroke-opacity:1;color-rendering:auto;image-rendering:auto;shape-rendering:auto;text-rendering:auto;enable-background:accumulate" />
      </g>
    </g>
  </g>
</svg>
