#----------------------------------------------------------------------------------------------
#
#   _____       _      _          _     ______       _                       _               
#  / ____|     (_)    | |        | |   |  ____|     | |                     (_)              
# | |  __ _   _ _  ___| |__   ___| |_  | |__   _ __ | |_ _ __ ___ _ __  _ __ _ ___  ___  ___ 
# | | |_ | | | | |/ __| '_ \ / _ \ __| |  __| | '_ \| __| '__/ _ \ '_ \| '__| / __|/ _ \/ __|
# | |__| | |_| | | (__| | | |  __/ |_  | |____| | | | |_| | |  __/ |_) | |  | \__ \  __/\__ \
#  \_____|\__,_|_|\___|_| |_|\___|\__| |______|_| |_|\__|_|  \___| .__/|_|  |_|___/\___||___/
#                                                                | |                         
#                                                                |_|                         
#
#----------------------------------------------------------------------------------------------
/* TEAM */
    Site: e-mail, lien vers un formulaire de contact, etc.
    Location: Paris, France

/* THANKS */
    Name: nom ou URL

/* SITE */
    Standards: HTML5, CSS3, ...
    Components: Modernizr, jQuery, etc.
