<?xml version="1.0" encoding="utf-8"?>
<!-- Generator: Adobe Illustrator 25.4.1, SVG Export Plug-In . SVG Version: 6.00 Build 0)  -->
<svg version="1.1" id="Calque_1" xmlns="http://www.w3.org/2000/svg" xmlns:xlink="http://www.w3.org/1999/xlink" x="0px" y="0px"
	 viewBox="0 0 260 116" style="enable-background:new 0 0 260 116;" xml:space="preserve">
<style type="text/css">
	.st0{fill:#FFFFFF;}
	.st1{clip-path:url(#SVGID_00000086678650867733420410000001572019042681993136_);}
	.st2{clip-path:url(#SVGID_00000086678650867733420410000001572019042681993136_);fill:#000091;}
	.st3{clip-path:url(#SVGID_00000086678650867733420410000001572019042681993136_);fill:#E1000F;}
	.st4{clip-path:url(#SVGID_00000086678650867733420410000001572019042681993136_);fill:#9E9D9C;}
	.st5{clip-path:url(#SVGID_00000086678650867733420410000001572019042681993136_);fill:#4C5459;}
	.st6{clip-path:url(#SVGID_00000086678650867733420410000001572019042681993136_);fill:#00798C;}
	
		.st7{clip-path:url(#SVGID_00000086678650867733420410000001572019042681993136_);fill:none;stroke:#000000;stroke-width:0.5;stroke-miterlimit:10;}
</style>
<rect y="0" class="st0" width="260" height="116"/>
<rect x="15" y="15.1" class="st0" width="41.6" height="15.1"/>
<g>
	<defs>
		<rect id="SVGID_1_" width="260" height="116"/>
	</defs>
	<clipPath id="SVGID_00000093863725467702357270000015507600898101872780_">
		<use xlink:href="#SVGID_1_"  style="overflow:visible;"/>
	</clipPath>
	<path style="clip-path:url(#SVGID_00000093863725467702357270000015507600898101872780_);" d="M15,37.8h3.5c2.5,0,4.1,1.3,4.1,3.4
		c0,1.4-0.7,2.4-1.8,2.9l3.6,5h-2.8l-3-4.6h-1.2v4.6H15V37.8z M17.3,39.8v2.8h1.3c1,0,1.5-0.5,1.5-1.4c0-0.9-0.6-1.4-1.5-1.4H17.3z"
		/>
	<path style="clip-path:url(#SVGID_00000093863725467702357270000015507600898101872780_);" d="M25.7,37.8h6.6v2H28v2.6h3.7v2H28
		v2.8h4.3v2h-6.6V37.8z M28,36.9l1.8-2.2h2.4l-2.1,2.2H28z"/>
	<path style="clip-path:url(#SVGID_00000093863725467702357270000015507600898101872780_);" d="M35,37.8h3.8c2.5,0,4,1.3,4,3.4
		c0,2.1-1.5,3.4-4,3.4h-1.4v4.6H35V37.8z M37.4,39.8v2.8h1.5c1,0,1.6-0.5,1.6-1.4c0-0.9-0.6-1.4-1.6-1.4H37.4z"/>
	<path style="clip-path:url(#SVGID_00000093863725467702357270000015507600898101872780_);" d="M51.5,37.8h2.3v6.9
		c0,3-1.8,4.8-4.6,4.8c-2.8,0-4.6-1.8-4.6-4.8v-6.9h2.3V45c0,1.5,0.9,2.4,2.3,2.4c1.4,0,2.3-0.9,2.3-2.4V37.8z"/>
	<path style="clip-path:url(#SVGID_00000093863725467702357270000015507600898101872780_);" d="M56.6,37.8h3.2
		c2.4,0,3.8,1.2,3.8,3.1c0,0.9-0.4,1.7-1.2,2.2c1.2,0.5,1.9,1.5,1.9,2.7c0,2.1-1.6,3.4-4.2,3.4h-3.5V37.8z M59,39.8v2.5h1
		c0.9,0,1.4-0.4,1.4-1.3c0-0.8-0.5-1.2-1.4-1.2H59z M59,44.3v3h1.3c1.1,0,1.7-0.6,1.7-1.5s-0.7-1.5-1.7-1.5H59z"/>
	<polygon style="clip-path:url(#SVGID_00000093863725467702357270000015507600898101872780_);" points="66.7,37.8 69,37.8 69,47.1 
		73.4,47.1 73.4,49.2 66.7,49.2 	"/>
	
		<rect x="75.4" y="37.8" style="clip-path:url(#SVGID_00000093863725467702357270000015507600898101872780_);" width="2.3" height="11.4"/>
	<path style="clip-path:url(#SVGID_00000093863725467702357270000015507600898101872780_);" d="M92.8,50c0.2,0,0.6,0,0.8-0.1v2
		c-0.4,0.1-0.7,0.2-1.2,0.2c-1.3,0-2.4-0.5-3.6-1.5l-1.4-1.2c-0.5,0.1-1,0.2-1.6,0.2c-3.6,0-6.1-2.8-6.1-6c0-3.3,2.5-6,6.1-6
		c3.6,0,6,2.8,6,6c0,1.9-0.8,3.6-2.2,4.8l0.7,0.7C91.3,49.7,92.1,50,92.8,50 M89.6,43.5c0-2.2-1.5-3.9-3.7-3.9
		c-2.1,0-3.7,1.7-3.7,3.9c0,2.2,1.5,3.9,3.7,3.9C88.1,47.4,89.6,45.7,89.6,43.5"/>
	<path style="clip-path:url(#SVGID_00000093863725467702357270000015507600898101872780_);" d="M100.9,37.8h2.3v6.9
		c0,3-1.8,4.8-4.6,4.8c-2.8,0-4.6-1.8-4.6-4.8v-6.9h2.3V45c0,1.5,0.9,2.4,2.3,2.4c1.4,0,2.3-0.9,2.3-2.4V37.8z"/>
	<polygon style="clip-path:url(#SVGID_00000093863725467702357270000015507600898101872780_);" points="106.1,37.8 112.8,37.8 
		112.8,39.8 108.4,39.8 108.4,42.4 112.1,42.4 112.1,44.4 108.4,44.4 108.4,47.3 112.8,47.3 112.8,49.2 106.1,49.2 	"/>
	<polygon style="clip-path:url(#SVGID_00000093863725467702357270000015507600898101872780_);" points="15,54.3 21.6,54.3 
		21.6,56.2 17.3,56.2 17.3,58.9 21,58.9 21,60.8 17.3,60.8 17.3,65.6 15,65.6 	"/>
	<path style="clip-path:url(#SVGID_00000093863725467702357270000015507600898101872780_);" d="M23.7,54.3h3.5
		c2.5,0,4.1,1.3,4.1,3.4c0,1.4-0.7,2.4-1.8,2.9l3.6,5h-2.8l-3-4.6H26v4.6h-2.3V54.3z M26,56.2v2.8h1.3c1,0,1.5-0.5,1.5-1.4
		c0-0.9-0.6-1.4-1.5-1.4H26z"/>
	<path style="clip-path:url(#SVGID_00000093863725467702357270000015507600898101872780_);" d="M37.8,54.3h3l4.3,11.4h-2.5l-1.1-3
		H37l-1.1,3h-2.5L37.8,54.3z M40.8,60.7l-1.6-4.3l-1.6,4.3H40.8z"/>
	<polygon style="clip-path:url(#SVGID_00000093863725467702357270000015507600898101872780_);" points="46.9,54.3 49.8,54.3 
		54.9,62.4 54.9,54.3 57.2,54.3 57.2,65.6 54.3,65.6 49.2,57.5 49.2,65.6 46.9,65.6 	"/>
	<path style="clip-path:url(#SVGID_00000093863725467702357270000015507600898101872780_);" d="M68.5,62.2l1.8,1.4
		c-0.9,1.2-2.2,2-3.9,2.3L65,68.3h-2.1l1.4-2.4c-3-0.5-4.9-3-4.9-5.9c0-3.3,2.5-6,6.1-6c2.1,0,3.8,0.9,4.8,2.3l-1.8,1.4
		c-0.7-0.9-1.7-1.6-3-1.6c-2.1,0-3.7,1.7-3.7,3.9s1.5,3.9,3.7,3.9C66.8,63.8,67.8,63.2,68.5,62.2"/>
	<path style="clip-path:url(#SVGID_00000093863725467702357270000015507600898101872780_);" d="M75.1,54.3h3l4.3,11.4H80l-1.1-3
		h-4.6l-1.1,3h-2.5L75.1,54.3z M78.2,60.7l-1.6-4.3l-1.6,4.3H78.2z"/>
	
		<rect x="84.2" y="54.3" style="clip-path:url(#SVGID_00000093863725467702357270000015507600898101872780_);" width="2.3" height="11.4"/>
	<path style="clip-path:url(#SVGID_00000093863725467702357270000015507600898101872780_);" d="M90.4,62.5c0.7,0.9,1.6,1.4,2.5,1.4
		c0.9,0,1.5-0.5,1.5-1.3c0-2-5.2-1.6-5.2-5.4c0-1.8,1.5-3.3,3.6-3.3c1.7,0,3,0.8,4,1.9l-1.7,1.5c-0.7-0.9-1.4-1.4-2.3-1.4
		c-0.8,0-1.3,0.5-1.3,1.2c0,2,5.2,1.6,5.2,5.4c0,2.1-1.7,3.4-3.8,3.4c-1.9,0-3.2-0.7-4.2-1.9L90.4,62.5z"/>
	<polygon style="clip-path:url(#SVGID_00000093863725467702357270000015507600898101872780_);" points="99.1,54.3 105.7,54.3 
		105.7,56.2 101.4,56.2 101.4,58.9 105.1,58.9 105.1,60.8 101.4,60.8 101.4,63.7 105.7,63.7 105.7,65.6 99.1,65.6 	"/>
	<path style="clip-path:url(#SVGID_00000093863725467702357270000015507600898101872780_);" d="M52.1,97.1c0.3,0,0.6,0.2,0.4,0.8
		l-1.4,0.3C51.3,97.6,51.7,97.1,52.1,97.1 M52.9,99.4h-0.3c-0.4,0.4-0.7,0.8-1.1,0.8c-0.4,0-0.6-0.2-0.6-0.8c0-0.2,0-0.4,0.1-0.6
		l2.3-0.8c0.5-1.1-0.1-1.5-0.7-1.5c-1.1,0-2.3,1.8-2.3,3.4c0,0.7,0.3,1.1,0.9,1.1C51.7,101,52.3,100.4,52.9,99.4 M52.4,96.1l1.6-1.5
		v-0.2h-0.9l-1,1.7H52.4z M47.4,97.1h0.8l-1.2,3.3c-0.1,0.3,0,0.6,0.3,0.6c0.7,0,1.8-0.7,2.2-1.6h-0.2c-0.3,0.3-0.9,0.8-1.4,0.9
		l1.1-3.1h1.1l0.1-0.5h-1.1l0.4-1.2h-0.4l-0.8,1.2l-0.9,0.1V97.1z M46.4,97c0.1-0.3-0.1-0.5-0.3-0.5c-0.7,0-1.5,0.6-1.8,1.4h0.2
		c0.2-0.3,0.6-0.7,0.9-0.7l-1.3,3.3c-0.1,0.3,0.1,0.5,0.3,0.5c0.6,0,1.4-0.6,1.7-1.4h-0.2c-0.2,0.3-0.6,0.7-0.9,0.7L46.4,97z
		 M46.6,95.3c0.3,0,0.6-0.2,0.6-0.6c0-0.3-0.3-0.6-0.6-0.6c-0.3,0-0.6,0.2-0.6,0.6C46.1,95.1,46.3,95.3,46.6,95.3 M39.2,100.4
		c-0.2,0.4,0,0.6,0.4,0.6c0.2,0,0.3-0.1,0.4-0.3l0.9-2.3c0.4-0.5,1.3-1,1.6-1c0.2,0,0.2,0.2,0,0.5l-1.4,2.6c-0.1,0.3,0,0.6,0.3,0.6
		c0.7,0,1.5-0.6,1.8-1.4h-0.2c-0.2,0.3-0.6,0.7-0.9,0.7l1.2-2.4c0.2-0.3,0.2-0.6,0.2-0.8c0-0.4-0.2-0.6-0.6-0.6
		c-0.6,0-1.2,0.7-1.9,1.5v-0.6c0-0.4-0.1-0.8-0.5-0.8c-0.3,0-0.5,0.2-0.7,0.5v0.1c0.4,0,0.6,0.6,0.3,1.3L39.2,100.4z M39.2,97.5
		c0.2-0.5,0.1-1-0.3-1c-0.5,0-0.6,0.4-1.1,1.5v-0.6c0-0.4-0.1-0.8-0.5-0.8c-0.5,0-0.9,0.7-1.2,1.4h0.2c0.2-0.3,0.4-0.5,0.6-0.5
		c0.2,0,0.3,0.3,0,1l-0.9,2c-0.2,0.4,0,0.6,0.4,0.6c0.2,0,0.3-0.1,0.4-0.3l0.9-2.3c0.3-0.3,0.5-0.6,0.8-0.9H39.2z M34.1,97.1
		c0.3,0,0.6,0.2,0.4,0.8l-1.4,0.3C33.4,97.6,33.8,97.1,34.1,97.1 M34.9,99.4h-0.3c-0.4,0.4-0.7,0.8-1.1,0.8c-0.4,0-0.6-0.2-0.6-0.8
		c0-0.2,0-0.4,0.1-0.6l2.3-0.8c0.5-1.1-0.1-1.5-0.7-1.5c-1.1,0-2.3,1.8-2.3,3.4c0,0.7,0.3,1.1,0.9,1.1
		C33.7,101,34.4,100.4,34.9,99.4 M29.4,97.1h0.8l-1.2,3.3c-0.1,0.3,0,0.6,0.3,0.6c0.7,0,1.8-0.7,2.2-1.6h-0.2
		c-0.3,0.3-0.9,0.8-1.4,0.9l1.1-3.1h1.1l0.1-0.5h-1.1l0.4-1.2h-0.4l-0.8,1.2l-0.9,0.1V97.1z M25.2,99.7c0-1,1.1-2.4,1.8-2.4
		c0.1,0,0.3,0,0.4,0.1l-0.7,1.8c-0.4,0.5-1,1-1.3,1C25.3,100.2,25.2,100,25.2,99.7 M28.7,96.3l-0.3,0L28,96.7h-0.1
		c-1.9,0-3.5,2.1-3.5,3.7c0,0.4,0.3,0.7,0.7,0.7c0.5,0,1-0.7,1.5-1.5l0,0.3c-0.1,0.8,0.2,1.2,0.6,1.2c0.5,0,0.9-0.7,1.2-1.4h-0.2
		c-0.2,0.3-0.4,0.5-0.6,0.5c-0.2,0-0.3-0.3,0-1L28.7,96.3z M24.7,97.5c0.2-0.5,0.1-1-0.3-1c-0.5,0-0.6,0.4-1.1,1.5v-0.6
		c0-0.4-0.1-0.8-0.5-0.8c-0.5,0-0.9,0.7-1.2,1.4h0.2c0.2-0.3,0.4-0.5,0.6-0.5c0.2,0,0.3,0.3,0,1l-0.9,2c-0.2,0.4,0,0.6,0.4,0.6
		c0.2,0,0.3-0.1,0.4-0.3l0.9-2.3c0.3-0.3,0.5-0.6,0.8-0.9H24.7z M18.3,100.9l0.1-0.3c-1.1-0.2-1.3-0.2-0.8-1.4l0.5-1.2h1.2
		c0.6,0,0.6,0.2,0.5,0.8H20l0.7-2h-0.3c-0.3,0.5-0.5,0.8-1.1,0.8h-1.2l0.6-1.8c0.2-0.6,0.3-0.7,1.1-0.7h0.5c0.8,0,0.9,0.2,0.9,1h0.3
		l0.3-1.4h-4.6L17.1,95c0.9,0.2,1,0.3,0.6,1.4l-1,2.7c-0.4,1.1-0.6,1.2-1.6,1.4l-0.1,0.3H18.3z"/>
	<path style="clip-path:url(#SVGID_00000093863725467702357270000015507600898101872780_);" d="M40.9,86.7c0.3,0,0.6,0.2,0.4,0.8
		l-1.4,0.3C40.1,87.2,40.5,86.7,40.9,86.7 M41.7,89h-0.3c-0.4,0.4-0.7,0.8-1.1,0.8c-0.4,0-0.6-0.2-0.6-0.8c0-0.2,0-0.4,0.1-0.6
		l2.3-0.8c0.5-1.1-0.1-1.5-0.7-1.5c-1.1,0-2.3,1.8-2.3,3.4c0,0.7,0.3,1.1,0.9,1.1C40.5,90.6,41.1,90,41.7,89 M41.2,85.6l1.6-1.5
		v-0.2H42l-1,1.7H41.2z M36.2,86.7H37L35.8,90c-0.1,0.3,0,0.6,0.3,0.6c0.7,0,1.8-0.7,2.2-1.6h-0.2c-0.3,0.3-0.9,0.8-1.4,0.9l1.1-3.1
		h1.1l0.1-0.5H38l0.4-1.2H38l-0.8,1.2l-0.9,0.1V86.7z M35.2,86.5c0.1-0.3-0.1-0.5-0.3-0.5c-0.7,0-1.5,0.6-1.8,1.4h0.2
		c0.2-0.3,0.6-0.7,0.9-0.7L33,90.1c-0.1,0.3,0.1,0.5,0.3,0.5c0.6,0,1.4-0.6,1.7-1.4h-0.2c-0.2,0.3-0.6,0.7-0.9,0.7L35.2,86.5z
		 M35.4,84.9c0.3,0,0.6-0.2,0.6-0.6c0-0.3-0.3-0.6-0.6-0.6c-0.3,0-0.6,0.3-0.6,0.6C34.9,84.6,35.1,84.9,35.4,84.9 M31,89.9l2.3-6.1
		l-0.1-0.1l-1.5,0.2V84l0.3,0.2c0.3,0.2,0.2,0.4-0.1,1L30.2,90c-0.1,0.3,0,0.6,0.3,0.6c0.7,0,1.4-0.6,1.7-1.4H32
		C31.8,89.5,31.3,89.8,31,89.9 M26.6,89.3c0-1,1.1-2.4,1.8-2.4c0.1,0,0.3,0,0.4,0.1l-0.7,1.8c-0.4,0.5-1,1-1.3,1
		C26.7,89.7,26.6,89.6,26.6,89.3 M30.1,85.9l-0.4,0l-0.4,0.4h-0.1c-1.9,0-3.6,2.1-3.6,3.7c0,0.4,0.3,0.7,0.7,0.7
		c0.5,0,1-0.7,1.5-1.5l0,0.3c-0.1,0.8,0.2,1.2,0.6,1.2c0.5,0,0.9-0.7,1.2-1.4h-0.2c-0.2,0.3-0.4,0.5-0.6,0.5c-0.2,0-0.3-0.3,0-1
		L30.1,85.9z M21.6,91.4c0-0.4,0.4-0.7,1-1c0.2,0.1,0.5,0.2,0.9,0.3c0.6,0.2,0.9,0.3,0.9,0.5c0,0.4-0.7,0.7-1.6,0.7
		C21.9,92,21.6,91.8,21.6,91.4 M23.3,88.7c-0.3,0-0.4-0.2-0.4-0.5c0-0.7,0.4-1.8,1-1.8c0.3,0,0.4,0.2,0.4,0.5
		C24.3,87.6,23.9,88.7,23.3,88.7 M25.1,91c0-0.5-0.5-0.7-1.3-1c-0.7-0.2-1-0.3-1-0.5c0-0.2,0.1-0.4,0.4-0.5c1.1-0.1,1.8-1,1.8-1.9
		c0-0.2,0-0.3-0.1-0.5H26l0.1-0.5h-1.5C24.4,86.1,24.2,86,24,86c-1.2,0-1.9,1-1.9,1.8c0,0.6,0.4,1,0.9,1.1c-0.5,0.2-0.8,0.5-0.8,0.9
		c0,0.2,0.1,0.3,0.2,0.5c-1.3,0.4-1.7,0.8-1.7,1.4c0,0.6,0.8,0.8,1.7,0.8C23.8,92.5,25.1,91.7,25.1,91 M19.3,87.4
		c0.6,0,0.6,0.2,0.5,0.8h0.3l0.7-2h-0.3c-0.3,0.5-0.5,0.8-1.1,0.8h-1.2l0.6-1.7c0.2-0.6,0.3-0.7,1.1-0.7h0.5c0.8,0,0.9,0.2,0.9,1
		h0.3l0.3-1.4h-4.6l-0.1,0.3c0.9,0.2,1,0.3,0.6,1.4l-1,2.7c-0.4,1.1-0.6,1.2-1.6,1.4L15,90.4h5.1L21,89h-0.4
		c-0.6,0.6-1.3,1.1-2.3,1.1c-1.4,0-1.2-0.1-0.8-1.3l0.5-1.3H19.3z M19.9,83.9l1.6-1.1v-0.2h-1l-0.9,1.3H19.9z"/>
	<path style="clip-path:url(#SVGID_00000093863725467702357270000015507600898101872780_);" d="M40.3,76.2c0.3,0,0.6,0.2,0.4,0.8
		l-1.4,0.3C39.6,76.7,40,76.2,40.3,76.2 M41.1,78.5h-0.3c-0.4,0.4-0.7,0.8-1.1,0.8c-0.4,0-0.6-0.2-0.6-0.8c0-0.2,0-0.4,0.1-0.6
		l2.3-0.8c0.5-1.1-0.1-1.5-0.7-1.5c-1.1,0-2.3,1.8-2.3,3.4c0,0.7,0.3,1.1,0.9,1.1C39.9,80.1,40.6,79.5,41.1,78.5 M40.7,75.2l1.6-1.5
		v-0.2h-0.9l-1,1.7H40.7z M35.9,76.2h0.6l-1.2,3.3c-0.1,0.3,0,0.6,0.3,0.6c0.7,0,1.8-0.7,2.2-1.6h-0.2c-0.3,0.3-0.9,0.8-1.4,0.9
		l1.1-3.1h1.1l0.1-0.5h-1.1l0.4-1.2h-0.4l-0.8,1.2l-0.8,0.1V76.2z M35.3,76.6c0.2-0.5,0.1-1-0.3-1c-0.5,0-0.6,0.4-1.1,1.5v-0.6
		c0-0.4-0.1-0.8-0.5-0.8c-0.5,0-0.9,0.7-1.2,1.4h0.2c0.2-0.3,0.4-0.5,0.6-0.5c0.2,0,0.3,0.3,0,1l-0.9,2c-0.2,0.4,0,0.6,0.4,0.6
		c0.2,0,0.3-0.1,0.4-0.3l0.9-2.3c0.3-0.3,0.5-0.6,0.8-0.9H35.3z M30.2,76.2c0.3,0,0.6,0.2,0.4,0.8l-1.4,0.3
		C29.4,76.7,29.8,76.2,30.2,76.2 M31,78.5h-0.3c-0.4,0.4-0.7,0.8-1.1,0.8c-0.4,0-0.6-0.2-0.6-0.8c0-0.2,0-0.4,0.1-0.6l2.3-0.8
		c0.5-1.1-0.1-1.5-0.7-1.5c-1.1,0-2.3,1.8-2.3,3.4c0,0.7,0.3,1.1,0.9,1.1C29.8,80.1,30.4,79.5,31,78.5 M25.3,79.5
		c-0.2,0-0.6-0.2-0.6-0.4c0-0.1,0.1-0.3,0.2-0.6l0.4-1c0.4-0.5,1-1,1.4-1c0.2,0,0.4,0.1,0.4,0.4C27.1,77.8,26.2,79.5,25.3,79.5
		 M27.9,76.5c0-0.7-0.3-0.9-0.7-0.9c-0.6,0-1.1,0.6-1.7,1.4l1.4-3.7l-0.1-0.1l-1.5,0.2v0.2l0.3,0.2c0.3,0.2,0.2,0.4-0.1,1l-1.5,3.9
		c-0.1,0.3-0.2,0.6-0.2,0.7c0,0.4,0.5,0.8,1,0.8C26,80.1,27.9,78.1,27.9,76.5 M23.4,76.1c0.1-0.3-0.1-0.5-0.3-0.5
		c-0.7,0-1.5,0.6-1.8,1.4h0.2c0.2-0.3,0.6-0.7,0.9-0.7l-1.3,3.3c-0.1,0.3,0.1,0.5,0.3,0.5c0.6,0,1.4-0.6,1.7-1.4h-0.2
		c-0.2,0.3-0.6,0.7-0.9,0.7L23.4,76.1z M23.6,74.4c0.3,0,0.6-0.2,0.6-0.6c0-0.3-0.2-0.6-0.6-0.6c-0.3,0-0.6,0.3-0.6,0.6
		C23.1,74.2,23.3,74.4,23.6,74.4 M20.2,73.9h-3l-0.1,0.3c0.9,0.2,1,0.3,0.6,1.4l-1,2.7c-0.4,1.1-0.6,1.2-1.6,1.4L15,80h4.6l1-1.8
		h-0.4c-0.6,0.6-1.2,1.4-2.3,1.4c-0.8,0-0.9-0.1-0.5-1.3l1-2.7c0.4-1.1,0.6-1.2,1.6-1.4L20.2,73.9z"/>
	<path style="clip-path:url(#SVGID_00000093863725467702357270000015507600898101872780_);fill:#000091;" d="M32.2,28.5
		c0.2-0.2,0.3-0.3,0.5-0.5h0c0.3-0.3,0.6-0.7,1-1c0.1-0.1,0.2-0.2,0.3-0.2c0,0,0-0.1,0.1-0.1c-0.1,0.1-0.2,0.2-0.4,0.2
		c0,0-0.1,0,0-0.1c0.1-0.1,0.2-0.2,0.3-0.2c0,0,0,0,0,0c0,0,0,0,0-0.1c-0.4-0.1-0.7,0.2-0.9,0.4c-0.1,0-0.1,0-0.1,0
		c-0.4,0.1-0.7,0.5-1.2,0.7v-0.1c-0.2,0.1-0.3,0.2-0.5,0.2c-0.3,0.1-0.5,0-0.7,0c-0.3,0-0.7,0.1-1,0.2c0,0,0,0,0,0
		c-0.2,0.1-0.4,0.1-0.5,0.2c0,0,0,0,0,0c0,0,0,0,0,0.1c-0.1,0.1-0.1,0.1-0.2,0.2c-0.2,0.1-0.3,0.2-0.5,0.4c0,0,0,0,0,0
		c-0.2,0.1-0.3,0.3-0.5,0.4c0,0-0.1,0-0.1,0c0,0,0,0,0,0c0,0,0,0,0,0c0,0,0-0.1,0.1-0.1c0,0,0.1-0.1,0.1-0.1c0-0.1,0.1-0.1,0.1-0.2
		c0,0,0,0,0,0c0,0,0,0,0,0c0.1-0.1,0.3-0.3,0.5-0.4c0,0,0,0,0,0c0,0,0,0,0,0c0,0,0-0.1,0-0.1c0,0,0,0,0,0c0,0,0,0,0,0
		c0,0-0.1,0.1-0.1,0.1c-0.1,0.1-0.1,0.2-0.2,0.2c0,0,0,0,0,0c0,0,0,0,0,0c0,0,0,0,0,0c0,0,0,0,0,0c0,0,0,0,0,0c0,0,0,0,0,0
		c0,0,0,0,0,0c0,0,0,0,0,0c0,0,0,0,0,0c0,0,0,0,0,0c0,0,0,0,0-0.1c0,0,0,0,0,0c0,0,0,0,0-0.1c0,0,0,0,0-0.1c0.1-0.1,0.1-0.1,0.2-0.2
		h0c0.1-0.1,0.2-0.1,0.3-0.2c0,0,0,0,0,0c-0.2,0.1-0.3,0.1-0.5,0.2c0,0,0,0,0,0c0,0,0,0-0.1,0c0,0,0,0,0,0c0-0.1,0.1-0.1,0.2-0.1
		c0,0,0.1,0,0.1,0c0.9-0.7,2.2-0.5,3.2-0.9c0.1-0.1,0.2-0.1,0.3-0.2c0.1-0.1,0.3-0.2,0.4-0.3c0.2-0.2,0.4-0.4,0.5-0.7
		c0,0,0-0.1,0-0.1c-0.4,0.4-0.8,0.7-1.3,0.9C30.6,27,30,26.9,29.3,27c0-0.1,0.1-0.1,0.1-0.1c0-0.1,0.1-0.1,0.1-0.2h0.1
		c0,0,0-0.1,0.1-0.1c0.1,0,0.1,0,0.1,0c-0.1-0.1-0.3,0.1-0.4,0c0.1-0.1,0-0.1,0.1-0.2h0.1c0-0.1,0.1-0.1,0.1-0.1
		c0.4-0.3,0.8-0.5,1.2-0.7c-0.1,0-0.1,0.1-0.2,0c0.1,0,0-0.1,0.1-0.1c0.3-0.1,0.6-0.3,0.9-0.4c-0.1,0-0.2,0.1-0.3,0
		c0.1,0,0.1-0.1,0.2-0.1v-0.1c0,0,0,0,0.1,0c0,0-0.1,0-0.1,0c0-0.1,0.1,0,0.2-0.1c0,0-0.1,0-0.1,0c0.1-0.1,0.2-0.1,0.4-0.2
		c0-0.1-0.1,0-0.1-0.1c0,0,0,0,0.1,0h-0.1c-0.1,0,0-0.1,0-0.1c0.2-0.2,0.2-0.5,0.3-0.7c0,0-0.1,0-0.1,0c-0.3,0.3-0.7,0.4-1.2,0.5
		h-0.1c-0.1,0.1-0.3,0.1-0.5,0c-0.1-0.1-0.2-0.1-0.3-0.2c-0.2-0.1-0.5-0.3-0.7-0.3c-0.7-0.2-1.5-0.3-2.2-0.3c0.3-0.2,0.7-0.2,1-0.3
		c0.5-0.1,0.9-0.3,1.5-0.3c-0.1,0-0.2,0-0.3,0c-0.4,0-0.8,0.1-1.2,0.2c-0.3,0.1-0.5,0.2-0.8,0.2c-0.2,0.1-0.3,0.2-0.5,0.2v-0.1
		c0.3-0.3,0.6-0.7,1.1-0.7c0.5-0.1,1,0,1.5,0.1c0.4,0,0.7,0.1,1.1,0.2c0.1,0,0.2,0.2,0.3,0.3c0.2,0.1,0.3,0,0.5,0.1
		c0-0.1,0-0.1,0-0.2c0.1-0.1,0.3,0,0.4,0c0.2-0.1-0.2-0.4-0.3-0.6c0,0,0-0.1,0-0.1c0.2,0.2,0.4,0.4,0.7,0.6c0.1,0.1,0.5,0.1,0.4,0
		c-0.1-0.3-0.4-0.6-0.7-0.9v-0.1c-0.1,0-0.1,0-0.1-0.1v-0.1c-0.1-0.1-0.1-0.2-0.1-0.3c-0.1-0.1,0-0.3-0.1-0.5
		c-0.1-0.2-0.1-0.3-0.1-0.5c-0.1-0.5-0.2-0.9-0.3-1.4c-0.1-0.5,0.3-1,0.6-1.5c0.2-0.3,0.4-0.7,0.8-0.9c0.1-0.3,0.3-0.6,0.5-0.9
		c0.2-0.3,0.6-0.4,0.9-0.6c0.4-0.2,0.8-0.3,0.8-0.3H15v15.1h13.9c0.5-0.4,1.1-0.6,1.8-1C31.1,29.1,31.9,28.8,32.2,28.5 M27.8,26.4
		c-0.1,0-0.2,0-0.1,0c0-0.1,0.2-0.1,0.3-0.2c0.1,0,0.1-0.1,0.2-0.1c0.1,0.1,0.1,0.1,0.2,0.1C28.2,26.4,28,26.3,27.8,26.4 M23.4,25.8
		C23.4,25.8,23.4,25.8,23.4,25.8c0.3-0.5,0.6-1,0.9-1.5c0.4-0.2,0.7-0.5,1-0.8c0.5-0.5,1-1,1.6-1.3c0.2-0.1,0.5-0.1,0.7,0
		c-0.1,0.1-0.2,0.1-0.3,0.2c0,0-0.1,0-0.1,0c0,0,0-0.1,0-0.1c-0.3,0.3-0.7,0.5-0.9,0.8c-0.2,0.3-0.3,0.7-0.7,0.7c-0.1,0,0-0.1,0-0.1
		C24.7,24.4,24.1,25,23.4,25.8 M25.8,23.9c0,0.1-0.1,0.1-0.1,0.1c0,0.1-0.1,0.1-0.1,0.1c0,0-0.1,0-0.1,0
		C25.5,24,25.6,23.9,25.8,23.9C25.8,23.9,25.8,23.9,25.8,23.9 M27.1,28.2C27.1,28.2,27,28.3,27.1,28.2c0,0.1,0,0.1,0,0.1
		c-0.1,0.1-0.1,0.1-0.2,0.2c0,0,0,0,0,0c0,0-0.1,0.1-0.1,0.1c0,0-0.2,0-0.1,0c0.1-0.1,0.1-0.1,0.2-0.2c0,0,0.1-0.1,0.1-0.1
		c0,0,0,0,0.1-0.1C27,28.2,27.1,28.1,27.1,28.2 M26.6,28C26.6,28,26.6,28,26.6,28c-0.1,0.1-0.2,0.2-0.3,0.2
		c-0.1,0.1-0.2,0.1-0.4,0.2c0,0,0,0,0,0c0,0,0,0,0,0c-0.1,0.1-0.2,0.1-0.3,0.2c0,0,0,0,0,0c0,0,0,0,0,0c0,0,0,0,0,0c0,0,0,0,0,0
		c0,0,0,0,0,0c0,0,0,0,0,0c0,0,0,0-0.1,0.1c0,0,0,0,0,0c0,0-0.1,0-0.1,0c0,0,0,0,0,0c0,0,0,0,0,0c0,0,0,0,0,0c0,0,0,0,0,0s0,0,0,0
		c0,0-0.1,0.1-0.1,0.1c-0.1,0.1-0.1,0.1-0.2,0.2c0,0,0,0,0,0c0,0,0,0,0,0c0,0,0,0,0,0s0,0,0,0c0,0,0,0,0,0c0,0,0,0,0,0c0,0,0,0,0,0
		c0,0,0,0,0,0c0,0,0,0,0,0c0,0,0,0,0,0c0,0,0,0,0,0c0,0,0,0,0,0c0,0,0,0,0,0c0,0,0.1-0.1,0.1-0.1c0,0,0,0,0,0c0,0,0,0,0,0
		c0,0,0,0,0-0.1c0,0,0,0,0,0c0,0,0.1-0.1,0.1-0.1c0,0,0,0,0,0c0,0,0,0,0,0c0,0,0,0,0-0.1c0,0,0,0,0-0.1c0,0,0,0,0,0s0,0,0,0
		c0,0,0,0,0,0c0,0,0,0,0-0.1c0,0,0,0,0,0c0,0,0,0,0,0c0,0,0,0,0,0h0c0,0,0,0,0,0c0,0,0,0,0,0c0,0,0,0,0,0c0-0.1,0.1-0.1,0.1-0.2
		c0,0,0,0,0,0c0,0-0.1,0.1-0.1,0.1c0,0-0.1,0-0.1,0c0,0,0,0,0.1-0.1c0,0,0,0,0,0c0,0,0.1-0.1,0.1-0.1c0,0,0.1,0,0.1-0.1c0,0,0,0,0,0
		c0,0,0,0,0.1-0.1c0,0,0,0,0,0c0.3-0.3,0.7-0.3,1.1-0.4c0.1-0.1,0.3,0,0.5,0c0.1,0,0.2,0,0.3,0.1C27,27.7,26.8,27.8,26.6,28
		 M27.2,26c0,0,0.1,0,0.1-0.1H27c0,0,0,0,0-0.1c-0.1,0-0.3,0.1-0.5,0.1c-0.2,0.1-0.4,0.2-0.6,0.3c-0.3,0.1-0.6,0.4-0.9,0.5
		c0,0,0,0,0-0.1c0-0.1,0.1-0.1,0.2-0.2c0,0,0-0.1,0-0.1c0.2-0.3,0.5-0.5,0.8-0.7v-0.1c0.1-0.1,0.2-0.2,0.3-0.3
		c0-0.1,0.1-0.2,0.3-0.3c0,0-0.1,0-0.1-0.1c-0.1,0-0.2,0.1-0.3,0c0.1-0.1,0.1-0.1,0.2-0.1c0,0,0,0-0.1,0c0-0.1,0.1-0.1,0.1-0.1
		c0.1,0,0.3,0,0.3-0.1c-0.2,0-0.4,0.1-0.6-0.1c0.1-0.4,0.4-0.7,0.7-0.9c0,0,0.1,0,0.1,0c0,0.1-0.1,0.3-0.2,0.3
		c0.2,0.1,0.5,0.1,0.7,0.2c0,0.1-0.1,0-0.1,0c0.1,0.1,0.3,0,0.5,0.1c-0.1,0.1-0.2,0-0.3,0c0.9,0.3,1.8,0.5,2.6,1
		c-0.6,0.3-1.3,0.5-2,0.6c-0.1,0-0.1,0-0.2,0c0,0,0,0.1,0,0.1c-0.1,0-0.2,0-0.3,0.1C27.4,26,27.2,26.1,27.2,26"/>
	<path style="clip-path:url(#SVGID_00000093863725467702357270000015507600898101872780_);fill:#E1000F;" d="M56.6,15.1H40.3
		c0,0,0,0,0.2,0.1c0.1,0.1,0.3,0.2,0.4,0.2c0.2,0.1,0.4,0.2,0.5,0.5c0.1,0.1,0.1,0.3,0.1,0.4c-0.1,0.1-0.1,0.4-0.2,0.4
		c-0.2,0.1-0.4,0.1-0.6,0.1c-0.1,0-0.2,0-0.3-0.1c0.4,0.2,0.8,0.4,1.1,0.8c0,0.1,0.1,0.1,0.3,0.1c0,0,0,0.1,0,0.1
		c-0.1,0.1-0.1,0.1-0.1,0.2h0.1c0.1-0.1,0.1-0.3,0.3-0.3c0.1,0.1,0.2,0.3,0.1,0.4c-0.1,0.1-0.2,0.2-0.3,0.3c0,0.1,0,0.1,0,0.2
		c0.1,0.1,0.1,0.2,0.1,0.3c0.1,0.2,0.1,0.4,0.2,0.6c0.1,0.4,0.2,0.9,0.2,1.3c0,0.2-0.1,0.4,0,0.7c0.1,0.2,0.2,0.4,0.3,0.6
		c0.1,0.2,0.2,0.3,0.3,0.5c0.2,0.3,0.5,0.6,0.3,0.9c-0.1,0.2-0.4,0.2-0.6,0.3c-0.2,0.1,0,0.4,0.1,0.5c0.1,0.3-0.2,0.4-0.4,0.5
		c0.1,0.1,0.2,0.1,0.2,0.1c0,0.1,0.2,0.2,0.1,0.4c-0.1,0.2-0.5,0.3-0.3,0.5c0.1,0.2,0,0.4,0,0.6c-0.1,0.3-0.3,0.4-0.5,0.4
		c-0.2,0.1-0.4,0.1-0.5,0c-0.1,0-0.1-0.1-0.2-0.1c-0.5-0.1-1-0.2-1.5-0.2c-0.1,0-0.3,0.1-0.4,0.1c-0.1,0.1-0.2,0.2-0.3,0.3
		c0,0,0,0,0,0c0,0,0,0-0.1,0.1c0,0,0,0,0,0c0,0,0,0,0,0c-0.1,0.1-0.2,0.2-0.2,0.3c0,0,0,0,0,0c0,0,0,0,0,0c-0.1,0.2-0.2,0.4-0.2,0.5
		c-0.2,0.7-0.1,1.2,0,1.4c0,0,0.9,0.3,1.6,0.6c0.3,0.1,0.5,0.2,0.7,0.3h16V15.1z"/>
	<path style="clip-path:url(#SVGID_00000093863725467702357270000015507600898101872780_);fill:#9E9D9C;" d="M41.3,20.7
		c0.1,0,0.3,0,0.3,0.1C41.5,21,41.1,21,41,21.3h-0.1c-0.1,0.1-0.1,0.2-0.1,0.2c-0.1,0-0.2,0-0.3,0c0.1,0.1,0.3,0.2,0.4,0.2
		c0,0,0.1,0.1,0.1,0.1c0,0,0,0,0.1,0c0,0,0.1,0,0.1,0v0.1C41,22,40.9,21.9,40.8,22c0.2,0.1,0.5,0.1,0.7,0c0.2-0.1,0-0.3,0.1-0.5
		c-0.1,0,0-0.1-0.1-0.1c0.1-0.1,0.1-0.1,0.2-0.2c0.1,0,0.1,0,0.2-0.1c0-0.1-0.1-0.1-0.1-0.1c0.2-0.1,0.3-0.3,0.3-0.5
		c0-0.1-0.3-0.1-0.4-0.1c-0.1-0.1-0.3,0-0.5,0c-0.1,0-0.3,0.1-0.4,0.1c-0.2,0.1-0.4,0.2-0.5,0.3c0.2-0.1,0.4-0.1,0.6-0.2
		C40.9,20.7,41.1,20.6,41.3,20.7"/>
	
		<rect x="143.1" y="37.8" style="clip-path:url(#SVGID_00000093863725467702357270000015507600898101872780_);fill:#4C5459;" width="8.2" height="37.5"/>
	
		<rect x="143.1" y="29.7" style="clip-path:url(#SVGID_00000093863725467702357270000015507600898101872780_);fill:#4C5459;" width="8.2" height="4.9"/>
	
		<rect x="236.9" y="37.8" style="clip-path:url(#SVGID_00000093863725467702357270000015507600898101872780_);fill:#4C5459;" width="8.2" height="37.5"/>
	
		<rect x="236.9" y="29.7" style="clip-path:url(#SVGID_00000093863725467702357270000015507600898101872780_);fill:#4C5459;" width="8.2" height="4.9"/>
	<path style="clip-path:url(#SVGID_00000093863725467702357270000015507600898101872780_);fill:#4C5459;" d="M229.6,42.9
		c-1.4-2.3-4.6-4.5-8.6-4.9c-3.3-0.3-22.6-0.2-22.6-0.2s0.7,7.5,6.9,7.5c1.6,0,4.6,0.2,7,0.2c1.6,0,5.2-0.2,6.4,0
		c1.7,0.2,3,1,3.8,2.2c1.3,1.8,1.5,4.4,1.5,7.7c0,3.3,0,6.5-2.2,8.5c-3.3,3.1-18,1.9-20.5,0.7c-2.3-1.1-3.4-2.5-3.5-5.6
		c0-3.7-0.1-7.4-0.1-7.4c0-2.5,0.4-6.4-2.5-9.5c-4.6-4.9-14.7-4.7-17.9-4.2c-6.1,1-10.5,4.5-11.5,5.4v-5.4h-8.2v37.5h8.2
		c0,0,0-19.4,0-21.7c0-1.6,0.3-2.6,1.4-3.8c6.1-6.6,18.7-5.6,21.2-1.7c1.2,1.8,1,5.3,1,8.2v32.1h8.2l0-19.1c0.7,1.4,2.5,3,4,3.2
		c3.6,0.7,13.2,0.8,16.9,0.5c3.8-0.3,7.9-1.4,10.8-5.6c1.6-2.2,2.5-6.6,2.5-12.1C232,49.2,231.3,45.9,229.6,42.9"/>
	
		<rect x="143.1" y="81.8" style="clip-path:url(#SVGID_00000093863725467702357270000015507600898101872780_);fill:#00798C;" width="38.3" height="6.5"/>
	
		<line style="clip-path:url(#SVGID_00000093863725467702357270000015507600898101872780_);fill:none;stroke:#000000;stroke-width:0.5;stroke-miterlimit:10;" x1="127.9" y1="15.1" x2="127.9" y2="101"/>
</g>
</svg>
