
Algoritmo
	variables A, B, C, prod tipo entero; fvariables
	
	inicio
		Esribir "Introduzca el valor de A";
		Leer A;
		Escribir "Introduzca el valor de B";
		Leer B;
		Escribir "Introduzca el valor de C";
		Leer C;
		
		
	si(A < 0){
		prod = A * B * C;
		Escribir "El producto es " + prod; 
	} sino{
		suma = A + B + C;
		Escribir "La suma es " + suma; 
	}				

Finalgoritmo