<?xml version="1.0" standalone="no"?>
<!DOCTYPE svg PUBLIC "-//W3C//DTD SVG 20010904//EN"
 "http://www.w3.org/TR/2001/REC-SVG-20010904/DTD/svg10.dtd">
<svg version="1.0" xmlns="http://www.w3.org/2000/svg"
 width="508.000000pt" height="487.000000pt" viewBox="0 0 508.000000 487.000000"
 preserveAspectRatio="xMidYMid meet">

<g transform="translate(0.000000,487.000000) scale(0.100000,-0.100000)"
fill="#000000" stroke="none">
<path d="M2290 4841 c-172 -38 -334 -111 -475 -215 -111 -82 -1666 -1638
-1723 -1724 -78 -119 -91 -277 -36 -420 27 -67 32 -73 1213 -1255 652 -654
1198 -1195 1213 -1203 39 -20 97 -17 138 7 40 24 2270 2252 2347 2346 64 77
93 154 100 259 7 96 -17 188 -68 269 -40 65 -1630 1654 -1724 1724 -99 74
-290 166 -410 198 -89 23 -122 26 -295 29 -163 3 -209 0 -280 -15z"/>
</g>
</svg>
