<?xml version="1.0" encoding="utf-8"?>
<!-- Generator: Adobe Illustrator 24.2.1, SVG Export Plug-In . SVG Version: 6.00 Build 0)  -->
<svg version="1.1" id="Layer_1" xmlns="http://www.w3.org/2000/svg" xmlns:xlink="http://www.w3.org/1999/xlink" x="0px" y="0px"
	 viewBox="0 0 172.17 56" style="enable-background:new 0 0 172.17 56;" xml:space="preserve">
<style type="text/css">
	.st0{fill:#5C666F;}
	.st1{fill:#EA6903;}
</style>
<g id="north_caucasus_ru">
	<g id="North-Caucasus-RU_RGB">
		<path class="st0" d="M51.1,37.28h-4.23l-4.45-5.41v5.41h-3.28v-13h3.28v5.06l4.24-5.06h4l-5.39,6.17L51.1,37.28z"/>
		<path class="st0" d="M55.38,37.56c-1.27,0.07-2.51-0.42-3.38-1.34c-0.85-0.88-1.32-2.06-1.3-3.29c-0.03-1.32,0.47-2.59,1.39-3.53
			c0.84-0.8,1.95-1.23,3.11-1.21c0.96-0.04,1.9,0.32,2.59,1v-0.71h3.11v8.8h-3.09v-0.76C57.2,37.22,56.31,37.61,55.38,37.56z
			 M54.48,31.41c-0.39,0.38-0.61,0.91-0.6,1.45c-0.01,0.53,0.18,1.05,0.55,1.43c0.41,0.4,0.97,0.63,1.55,0.62c1.1,0,2-0.9,2-2
			c0.01-0.55-0.21-1.08-0.6-1.47c-0.41-0.35-0.93-0.54-1.47-0.55c-0.54,0-1.05,0.2-1.44,0.57L54.48,31.41z"/>
		<path class="st0" d="M68.27,37.28h-5.43v-8.8h4.79c0.79-0.07,1.59,0.14,2.25,0.58c0.51,0.44,0.78,1.1,0.75,1.77
			c0.03,0.55-0.17,1.09-0.56,1.48c-0.12,0.13-0.26,0.24-0.41,0.32c0.37,0.11,0.71,0.3,1,0.55c0.42,0.4,0.64,0.97,0.61,1.55
			c0.02,0.65-0.23,1.28-0.69,1.74C69.96,37.05,69.12,37.34,68.27,37.28z M65.92,35.16h1.13c0.26,0.03,0.52-0.04,0.74-0.19
			c0.15-0.15,0.24-0.35,0.23-0.56c0.01-0.19-0.08-0.37-0.23-0.49c-0.26-0.16-0.56-0.23-0.86-0.2h-1L65.92,35.16z M65.92,31.88h1
			c0.22,0.01,0.43-0.04,0.62-0.15c0.16-0.12,0.25-0.31,0.23-0.51c0.01-0.19-0.06-0.36-0.2-0.49c-0.22-0.1-0.45-0.15-0.69-0.14h-1
			L65.92,31.88z"/>
		<path class="st0" d="M82.26,37.28h-4l-2.75-3.52v3.52h-3.09v-8.8h3.09v3.14l2.64-3.14H82l-3.85,4.1L82.26,37.28z"/>
		<path class="st0" d="M86.68,37.56c-1.26,0.07-2.49-0.42-3.36-1.34c-0.86-0.88-1.33-2.06-1.32-3.29c-0.02-1.32,0.48-2.59,1.4-3.53
			c0.84-0.8,1.96-1.23,3.12-1.21c0.96-0.04,1.9,0.32,2.59,1v-0.71h3.09v8.8h-3.09v-0.76C88.5,37.22,87.61,37.61,86.68,37.56z
			 M87.22,30.84c-0.54,0-1.05,0.2-1.44,0.57l0,0c-0.39,0.38-0.61,0.91-0.6,1.45c-0.01,0.53,0.18,1.05,0.55,1.43
			c0.41,0.4,0.97,0.63,1.55,0.62c1.1,0,2-0.9,2-2c0.01-0.55-0.21-1.08-0.6-1.47C88.28,31.07,87.76,30.86,87.22,30.84z"/>
		<path class="st0" d="M97.42,37.56c-0.82,0.01-1.64-0.12-2.42-0.39c-0.58-0.22-1.12-0.53-1.6-0.92l-0.1-0.08l1.35-2.05l0.12,0.1
			c0.3,0.27,0.64,0.5,1,0.67c0.41,0.16,0.84,0.24,1.28,0.25C97.37,35.16,97.7,35.11,98,35c0.2-0.1,0.33-0.31,0.32-0.53
			C98.33,34.26,98.2,34.06,98,34c-0.32-0.1-0.66-0.15-1-0.14h-1.12v-2.17h0.94c0.34,0,0.68-0.05,1-0.15
			c0.19-0.06,0.32-0.24,0.32-0.44c0-0.08,0-0.29-0.34-0.42c-0.26-0.11-0.54-0.16-0.82-0.15c-0.38,0-0.75,0.07-1.1,0.22
			c-0.32,0.13-0.63,0.31-0.9,0.53l-0.13,0.11l-1.22-2.09l0.12-0.08c0.46-0.28,0.95-0.52,1.46-0.71c0.68-0.22,1.39-0.33,2.1-0.32
			c1.08-0.05,2.14,0.27,3,0.92c0.46,0.43,0.71,1.04,0.68,1.67c0.04,0.57-0.16,1.14-0.56,1.55c-0.14,0.13-0.3,0.25-0.46,0.35
			c0.33,0.11,0.63,0.3,0.88,0.54c0.42,0.39,0.65,0.94,0.63,1.51c0,0.71-0.29,1.39-0.8,1.88C99.76,37.35,98.59,37.69,97.42,37.56z"/>
		<path class="st0" d="M104.62,37.58c-1.04-0.02-1.87-0.87-1.85-1.91s0.87-1.87,1.91-1.85c1.03,0.02,1.85,0.85,1.85,1.88
			c0.01,1.03-0.83,1.87-1.86,1.88C104.65,37.58,104.64,37.58,104.62,37.58z"/>
		<path class="st0" d="M111.26,37.28H108v-13h4.72c1.26-0.09,2.51,0.3,3.5,1.08c0.9,0.81,1.39,1.99,1.32,3.2
			c0.05,1.15-0.37,2.26-1.15,3.1c-0.93,0.82-2.15,1.24-3.39,1.15h-1.69L111.26,37.28z M111.26,30.12h0.94
			c0.54,0.04,1.08-0.11,1.52-0.44c0.29-0.31,0.45-0.73,0.44-1.16c0.02-0.42-0.14-0.84-0.44-1.14c-0.46-0.33-1.02-0.49-1.58-0.44
			h-0.88V30.12z"/>
		<path class="st0" d="M123.24,37.56c-1.31,0.09-2.6-0.36-3.56-1.26c-0.89-0.9-1.38-2.12-1.35-3.38c-0.02-1.29,0.48-2.53,1.37-3.46
			c2.02-1.72,5-1.7,7,0.05c0.88,0.97,1.33,2.25,1.26,3.56v0.42h-6.48c0.03,0.45,0.2,0.87,0.48,1.22c0.36,0.35,0.84,0.53,1.34,0.49
			c0.37,0.02,0.73-0.06,1.06-0.23c0.24-0.16,0.43-0.38,0.55-0.65v-0.08l2.92,0.29v0.17c-0.29,0.92-0.91,1.71-1.74,2.21
			C125.22,37.39,124.23,37.62,123.24,37.56z M121.59,31.56H125c-0.09-0.28-0.26-0.54-0.47-0.75c-0.75-0.61-1.84-0.58-2.55,0.08
			C121.8,31.09,121.67,31.32,121.59,31.56L121.59,31.56z"/>
		<path class="st0" d="M133.42,37.56c-1.26,0.07-2.49-0.42-3.36-1.34c-0.86-0.88-1.33-2.06-1.3-3.29c-0.03-1.31,0.47-2.58,1.38-3.53
			c0.84-0.8,1.96-1.23,3.12-1.21c0.96-0.04,1.9,0.32,2.59,1v-0.71h3.08v8.8h-3.08v-0.76C135.24,37.22,134.35,37.6,133.42,37.56z
			 M133.96,30.84c-0.54,0-1.05,0.2-1.44,0.57l0,0c-0.39,0.38-0.61,0.91-0.6,1.45c-0.01,0.53,0.18,1.04,0.54,1.43
			c0.42,0.4,0.98,0.63,1.56,0.62c1.1,0,2-0.9,2-2c0.01-0.55-0.21-1.08-0.6-1.47c-0.39-0.36-0.89-0.57-1.42-0.6L133.96,30.84z"/>
		<path class="st0" d="M141.19,37.39c-0.38,0-0.76-0.04-1.13-0.14h-0.1v-2.49l0.18,0.05c0.41,0.14,0.86,0.06,1.2-0.21
			c0.24-0.38,0.35-0.82,0.31-1.26v-4.86h8v8.8h-3.09V31h-2v2.48c0.09,1.08-0.23,2.15-0.89,3C143.02,37.13,142.11,37.47,141.19,37.39
			z"/>
		<path class="st0" d="M161,37.28h-3.09v-4.67l-3.49,4.67h-2.82v-8.8h3.08v4.59l3.5-4.59H161V37.28z"/>
		<path class="st0" d="M172.17,37.28h-3.08v-4.67l-3.5,4.67h-2.82v-8.8h3.09v4.59l3.49-4.59h2.82V37.28z"/>
	</g>
	<path id="M" class="st1" d="M36.32,16.92c-4.8,0.56-6.14,5.54-9.75,9.84c-4.83,5.74-12,2.79-12,2.79c4.83-0.6,6.21-5.62,9.91-9.9
		C29.4,14,36.32,16.92,36.32,16.92z M18.93,25.34c0,0,6-4.77,3.42-11.8c-2-5.3-5.71-9.06-3.72-13.48c0,0-5.94,4.84-3.47,11.8
		C17.05,17.18,20.93,20.92,18.93,25.34z M18.59,24.34c0,0,0.57-7.73-6.07-10.67C7.34,11.37,1.89,11.58,0,7.1
		c0,0-0.74,7.69,6.31,10.66c5.24,2.24,10.41,2.09,12.28,6.57V24.34z M10.69,37.34h13.48L27.32,31H10.69L10.69,37.34z M12.84,55.97
		H14l7.74-17.78h-8.9V55.97z"/>
</g>
</svg>
