{
    "dev": {
        "django_settings": "config.settings",
       // "profile_name": "edas-ps-dev-iam-tony",
        "delete_local_zip": false,
        "AWS_ACCESS_KEY_ID": "AKIA6BBMCJHHVBJSN6AT",
        "AWS_SECRET_ACCESS_KEY": "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",
        "AWS_DEFAULT_REGION": "us-west-2",
        
        "project_name": "edas-ps-api",
        "runtime": "python3.7",
        "s3_bucket": "ps-api-build",
        "environment_variables": {            
            "AWS_ACCESS_KEY_ID": "AKIA6BBMCJHHVBJSN6AT",
            "AWS_SECRET_ACCESS_KEY": "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",
            "AWS_REGION": "us-west-2",
            "AWS_STORAGE_BUCKET_NAME": "edas-ps-storage",
            "SES_SOURCE_EMAIL": "Photoscout DEV <tony@gortek.com>",
            "AWS_SES_SOURCE_ARN": "arn:aws:ses:us-west-2:964312582607:identity/tony@gortek.com",
            "STRIPE_API_KEY": "",
            "PLACES_API_KEY": "",
            "JWT_SECRET_KEY": "9cccpl5544-5bye5-33r44f-bw757-0e7aqf0d3972fza9bb-46c2p-85e7-ffea7e8&84767c547750-46e3-68cc-b69f-cef6.e672ef87",
            "DJANGO_ALLOWED_HOST": ".execute-api.us-west-2.amazonaws.com",
            "DJANGO_CORS_WHITELIST": "https://d15qatxw4j3re.cloudfront.net",
            "DJANGO_SECRET_KEY": "ab@_=1c3zwr8oml-otyqcw_nb@cw08mq_j8_pyk3dam8$+j37",
            "DJANGO_DEBUG": "False",
            "MONGODB_DRIVER_STRING": "mongodb+srv://dbAdmin:go24BN7WByT8rfR5@cluster0-wgzmn.mongodb.net/test?retryWrites=true&w=majority",
            
        }
    }
}
