{
  "settings": {
    "refresh_interval": "1ms",
    "number_of_shards": 1,
    "number_of_replicas": 1
  },
  "mappings": {
    "simples": {
      "properties": {
        "identifier": {
          "type": "keyword"
        },
        "forename": {
          "type": "keyword"
        },
        "surname": {
          "type": "keyword"
        },
        "emails": {
          "type": "keyword"
        }
      }
    }
  }
}
