<?xml version="1.0" encoding="UTF-8" standalone="no"?>
<svg
   xmlns:dc="http://purl.org/dc/elements/1.1/"
   xmlns:cc="http://creativecommons.org/ns#"
   xmlns:rdf="http://www.w3.org/1999/02/22-rdf-syntax-ns#"
   xmlns:svg="http://www.w3.org/2000/svg"
   xmlns="http://www.w3.org/2000/svg"
   xmlns:sodipodi="http://sodipodi.sourceforge.net/DTD/sodipodi-0.dtd"
   xmlns:inkscape="http://www.inkscape.org/namespaces/inkscape"
   inkscape:export-ydpi="96"
   inkscape:export-xdpi="96"
   inkscape:export-filename="/data/devel/emile2/emile-client/android/res/drawable-xxxhdpi/emile-notification.png"
   sodipodi:docname="emile-notification.svg"
   inkscape:version="1.0 (4035a4fb49, 2020-05-01)"
   id="svg8"
   version="1.1"
   viewBox="0 0 101.6 101.6"
   height="384"
   width="384">
  <defs
     id="defs2" />
  <sodipodi:namedview
     inkscape:document-rotation="0"
     inkscape:snap-bbox="true"
     units="px"
     inkscape:window-maximized="1"
     inkscape:window-y="0"
     inkscape:window-x="0"
     inkscape:window-height="703"
     inkscape:window-width="1366"
     showgrid="false"
     inkscape:current-layer="layer1"
     inkscape:document-units="mm"
     inkscape:cy="182.38736"
     inkscape:cx="-3.2877033"
     inkscape:zoom="0.87668421"
     inkscape:pageshadow="2"
     inkscape:pageopacity="0"
     borderopacity="1.0"
     bordercolor="#666666"
     pagecolor="#ffffff"
     id="base" />
  <metadata
     id="metadata5">
    <rdf:RDF>
      <cc:Work
         rdf:about="">
        <dc:format>image/svg+xml</dc:format>
        <dc:type
           rdf:resource="http://purl.org/dc/dcmitype/StillImage" />
        <dc:title></dc:title>
      </cc:Work>
    </rdf:RDF>
  </metadata>
  <g
     transform="translate(0,-169.99998)"
     id="layer1"
     inkscape:groupmode="layer"
     inkscape:label="Layer 1">
    <path
       sodipodi:nodetypes="ccccccccsccccccccccsscscscccscccccccccscscccccsscccccccsscccsscccscscsccsscsccccccscacccccacscccc"
       style="fill:#03728c;fill-opacity:1;stroke-width:0.455696"
       d="m 20.38742,255.29557 c -5.78309,-3.05328 -3.735198,-11.91616 2.904932,-12.57196 5.35521,-0.52904 9.188575,5.88708 6.194851,10.36844 -2.007916,3.00568 -5.828204,3.93078 -9.099783,2.20352 z m 10.489827,-12.70996 c -4.27858,-4.44656 -6.69124,-4.37752 -15.33166,0.43892 C 8.5636422,246.91661 0.03416602,242.01121 9.6663626e-5,234.08417 -0.00683664,232.34289 0.35870997,231.04097 1.4520698,228.921 c 1.5400904,-2.98612 2.8892797,-4.2406 5.1455887,-4.78416 4.5137115,-1.08736 6.9949005,-0.69072 10.5526495,1.687 1.705984,1.14008 2.366213,1.94016 2.909342,3.52544 1.589882,4.64057 4.210926,7.79489 7.228373,8.69893 1.690568,0.50668 2.398643,0.48052 4.994115,-0.1846 4.026267,-1.03178 4.466107,-0.9905 6.021316,0.5647 2.76532,2.7653 0.989271,6.82688 -2.997068,6.85378 -1.636364,0.014 -2.08932,-0.26454 -4.429139,-2.69648 z m 34.484247,-1.59528 c -1.579528,-1.57956 -1.559964,-4.43988 0.04049,-5.9232 1.013661,-0.9394 1.696509,-1.09384 5.443807,-1.23136 4.189117,-0.1536 4.321805,-0.1934 5.943117,-1.7522 2.178632,-2.09537 2.882991,-3.52261 3.602879,-7.30069 0.883448,-4.63644 2.513715,-7.12084 5.555391,-8.46604 2.7428,-1.213 6.605016,-1.41736 9.174593,-0.48532 3.573574,1.296 6.500879,5.84532 6.478099,10.0676 -0.0284,5.20429 -5.308313,10.28589 -10.687952,10.28589 -0.781964,0 -3.154906,-0.61116 -5.273243,-1.35812 -4.498248,-1.58616 -6.322109,-1.68252 -8.98312,-0.47468 -1.391303,0.63152 -2.295615,1.4888 -3.189855,3.02396 -2.02616,3.47828 -3.440384,4.73284 -5.335007,4.73284 -1.145008,0 -1.993365,-0.3428 -2.769216,-1.11852 z m -38.485445,-6.91044 c -1.903825,-1.19252 -2.889521,-2.92032 -3.070497,-5.38225 -0.313492,-4.26412 2.291771,-7.09268 6.534122,-7.09428 3.347276,-0.001 4.718623,0.77776 5.923284,3.36496 1.663376,3.57232 1.478359,5.20901 -0.874496,7.73553 -1.918644,2.06036 -2.037048,2.1136 -4.670868,2.1018 -1.644672,-0.001 -3.148195,-0.2912 -3.841545,-0.72576 z m 14.881284,0.22212 c -1.299328,-0.75528 -2.175952,-3.31416 -1.844812,-5.38505 0.8823,-5.5176 -2.091296,-8.69512 -9.702134,-10.36744 -3.065932,-0.67369 -3.803218,-1.03697 -5.453347,-2.68705 -2.802868,-2.80288 -3.546718,-4.46696 -3.544958,-7.93032 0.0036,-8.17551 7.909185,-12.95399 15.265756,-9.22776 3.560599,1.80344 5.147407,4.33352 5.358736,8.54424 0.12,2.3904 -0.06489,3.76089 -0.737681,5.46832 -0.49376,1.2532 -1.043112,3.54232 -1.220744,5.08704 -0.449815,3.9116 0.368049,5.47761 4.146255,7.93921 3.369329,2.19519 4.269272,3.27232 4.269272,5.11009 0,1.87216 -2.218303,3.96888 -4.18012,3.95096 -0.833831,-0.001 -1.894135,-0.2336 -2.356223,-0.5024 z m 13.71351,-1.3432 c -1.169527,-0.6812 -2.278544,-3.09274 -1.976215,-4.29737 0.14434,-0.57512 1.210487,-2.0212 2.369159,-3.21336 2.57244,-2.64681 3.36908,-4.44729 3.358296,-7.58992 -0.0067,-1.84768 -0.33924,-2.98953 -1.43258,-4.91337 -3.007403,-5.292 -3.116115,-5.59008 -3.116115,-8.54487 0,-3.50337 1.019495,-5.73441 3.648907,-7.98512 6.061223,-5.18821 15.45955,-1.89416 16.923582,5.93151 0.99825,5.33585 -1.513458,9.64632 -7.110189,12.202 -2.188418,0.99936 -3.897674,2.20328 -5.373725,3.78488 -2.030448,2.17568 -2.164546,2.47232 -2.164546,4.78792 0,1.35769 0.29772,3.31232 0.66157,4.34361 0.50288,1.42528 0.545664,2.20759 0.17842,3.26103 -0.769424,2.20714 -3.960591,3.40146 -5.966603,2.23306 z m 11.091499,-3.11514 c -1.501144,-1.40224 -2.775068,-3.93031 -2.775068,-5.50704 0,-1.49295 2.106156,-5.25008 3.428832,-6.11672 1.470614,-0.9636 4.517883,-1.13416 6.368603,-0.3564 3.06399,1.28745 4.76289,6.51217 3.193162,9.82016 -1.107753,2.3344 -3.184206,3.48898 -6.274698,3.48898 -2.152973,0 -2.724621,-0.1922 -3.940831,-1.3289 z m -20.361874,-5.76711 c -0.775319,-0.3824 -1.873039,-1.51993 -2.439376,-2.52768 -0.845026,-1.50352 -0.97325,-2.21465 -0.714887,-3.96496 0.410455,-2.78057 1.696888,-4.81977 3.614664,-5.72985 5.973663,-2.83464 11.98297,3.29704 8.986838,9.16985 -1.414919,2.77351 -2.929304,3.77088 -5.706638,3.75856 -1.282017,-0.001 -2.965288,-0.3232 -3.740601,-0.70592 z M 6.7486025,216.63951 c -3.0172958,-1.91351 -3.7564797,-4.3464 -2.371909,-7.8068 0.5428319,-1.35664 1.2347358,-2.10392 2.5865966,-2.7936 4.9928689,-2.54719 10.3882869,1.66128 8.9548149,6.98472 -0.541247,2.01008 -1.279812,2.82617 -3.653653,4.03721 -2.3354875,1.19151 -3.059701,1.13615 -5.5158495,-0.42129 z m 78.9120155,-6.75783 c -1.746048,-0.65608 -3.184973,-2.13417 -3.899829,-4.00601 -0.739457,-1.93623 -0.738545,-2.15584 0.0174,-4.13408 1.024648,-2.68296 2.825045,-3.8308 6.012489,-3.83312 2.813686,-9.6e-4 4.793003,1.37433 5.631935,3.91632 1.582812,4.796 -3.207172,9.76825 -7.761527,8.05689 z M 44.875965,197.46952 c -1.840859,-0.76641 -3.513368,-3.06384 -3.748375,-5.1488 -0.36964,-3.27941 1.520468,-6.00973 4.648887,-6.71525 2.326687,-0.5248 4.48436,0.2064 6.125255,2.07509 2.585559,2.9448 1.604551,7.79543 -1.914279,9.46527 -1.717969,0.8152 -3.638857,0.93688 -5.111488,0.3236 z"
       id="path29-6"
       inkscape:connector-curvature="0" />
  </g>
</svg>
