\relax 
\providecommand\HyperFirstAtBeginDocument{\AtBeginDocument}
\HyperFirstAtBeginDocument{\ifx\hyper@anchor\@undefined
\global\let\oldcontentsline\contentsline
\gdef\contentsline#1#2#3#4{\oldcontentsline{#1}{#2}{#3}}
\global\let\oldnewlabel\newlabel
\gdef\newlabel#1#2{\newlabelxx{#1}#2}
\gdef\newlabelxx#1#2#3#4#5#6{\oldnewlabel{#1}{{#2}{#3}}}
\AtEndDocument{\ifx\hyper@anchor\@undefined
\let\contentsline\oldcontentsline
\let\newlabel\oldnewlabel
\fi}
\fi}
\global\let\hyper@last\relax 
\gdef\HyperFirstAtBeginDocument#1{#1}
\providecommand\HyField@AuxAddToFields[1]{}
\@writefile{toc}{\contentsline {chapter}{\numberline {1}Data Structure Index}{1}{chapter.1}}
\@writefile{lof}{\addvspace {10\p@ }}
\@writefile{lot}{\addvspace {10\p@ }}
\@writefile{toc}{\contentsline {section}{\numberline {1.1}Class Hierarchy}{1}{section.1.1}}
\@writefile{toc}{\contentsline {chapter}{\numberline {2}Data Structure Index}{3}{chapter.2}}
\@writefile{lof}{\addvspace {10\p@ }}
\@writefile{lot}{\addvspace {10\p@ }}
\@writefile{toc}{\contentsline {section}{\numberline {2.1}Data Structures}{3}{section.2.1}}
\@writefile{toc}{\contentsline {chapter}{\numberline {3}Data Structure Documentation}{5}{chapter.3}}
\@writefile{lof}{\addvspace {10\p@ }}
\@writefile{lot}{\addvspace {10\p@ }}
\@writefile{toc}{\contentsline {section}{\numberline {3.1}Dataflow\discretionary {-}{}{}:\discretionary {-}{}{}:Base\discretionary {-}{}{}Input Class Reference}{5}{section.3.1}}
\newlabel{classDataflow_1_1BaseInput}{{3.1}{5}{Dataflow\-:\-:Base\-Input Class Reference\relax }{section.3.1}{}}
\newlabel{classDataflow_1_1BaseInput_a6b4117828d89e64e7686b3d30d9cd8a9}{{3.1}{5}{Public Member Functions\relax }{section*.2}{}}
\newlabel{classDataflow_1_1BaseInput_a337c47fb8435155610b9d5e9e05c0ba9}{{3.1}{5}{Public Member Functions\relax }{section*.2}{}}
\newlabel{classDataflow_1_1BaseInput_a58d4f921bde6e76413f21dc011f2beab}{{3.1}{5}{Public Member Functions\relax }{section*.2}{}}
\newlabel{classDataflow_1_1BaseInput_a2b17b15ef12084a10eb24b99be2169ad}{{3.1}{5}{Public Member Functions\relax }{section*.2}{}}
\@writefile{toc}{\contentsline {subsection}{\numberline {3.1.1}Detailed Description}{5}{subsection.3.1.1}}
\gdef \LT@i {\LT@entry 
    {1}{55.42702pt}\LT@entry 
    {1}{77.78368pt}\LT@entry 
    {1}{321.34094pt}}
\gdef \LT@ii {\LT@entry 
    {1}{55.42702pt}\LT@entry 
    {1}{77.78368pt}\LT@entry 
    {1}{321.34094pt}}
\gdef \LT@iii {\LT@entry 
    {1}{123.71086pt}\LT@entry 
    {1}{360.03975pt}}
\@writefile{toc}{\contentsline {subsection}{\numberline {3.1.2}Member Function Documentation}{6}{subsection.3.1.2}}
\@writefile{toc}{\contentsline {subsubsection}{\numberline {3.1.2.1}bind}{6}{subsubsection.3.1.2.1}}
\newlabel{classDataflow_1_1BaseInput_ada6c28202cc05198b6b0dff2b5012127}{{3.1.2.1}{6}{bind\relax }{subsubsection.3.1.2.1}{}}
\@writefile{toc}{\contentsline {subsubsection}{\numberline {3.1.2.2}check}{6}{subsubsection.3.1.2.2}}
\newlabel{classDataflow_1_1BaseInput_a124afb834f3728a9aa954690d0ee83a3}{{3.1.2.2}{6}{check\relax }{subsubsection.3.1.2.2}{}}
\@writefile{toc}{\contentsline {subsubsection}{\numberline {3.1.2.3}value}{6}{subsubsection.3.1.2.3}}
\newlabel{classDataflow_1_1BaseInput_a01cd976a1b6e87d700fa1f644625b8b6}{{3.1.2.3}{6}{value\relax }{subsubsection.3.1.2.3}{}}
\@writefile{toc}{\contentsline {subsubsection}{\numberline {3.1.2.4}value}{6}{subsubsection.3.1.2.4}}
\newlabel{classDataflow_1_1BaseInput_a1fe4860902069bc168f93ae269b49b03}{{3.1.2.4}{6}{value\relax }{subsubsection.3.1.2.4}{}}
\@writefile{toc}{\contentsline {section}{\numberline {3.2}Dataflow\discretionary {-}{}{}:\discretionary {-}{}{}:Base\discretionary {-}{}{}Output Class Reference}{6}{section.3.2}}
\newlabel{classDataflow_1_1BaseOutput}{{3.2}{6}{Dataflow\-:\-:Base\-Output Class Reference\relax }{section.3.2}{}}
\newlabel{classDataflow_1_1BaseOutput_ac917d069881bfe91250dbe00776f8733}{{3.2}{7}{Public Member Functions\relax }{section*.3}{}}
\newlabel{classDataflow_1_1BaseOutput_a49ff6d883e55d840dd827a2582c58b78}{{3.2}{7}{Public Member Functions\relax }{section*.3}{}}
\newlabel{classDataflow_1_1BaseOutput_ad462fbaa0f5188e9d4de2e2fec719837}{{3.2}{7}{Public Member Functions\relax }{section*.3}{}}
\newlabel{classDataflow_1_1BaseOutput_a9a9168cd2f530385df6e9e9737bb0ac7}{{3.2}{7}{Data Fields\relax }{section*.4}{}}
\newlabel{classDataflow_1_1BaseOutput_a77cad89b63e17a462f48e9b6b842ec4b}{{3.2}{7}{Data Fields\relax }{section*.4}{}}
\@writefile{toc}{\contentsline {section}{\numberline {3.3}Base\discretionary {-}{}{}Signal Class Reference}{7}{section.3.3}}
\newlabel{classBaseSignal}{{3.3}{7}{Base\-Signal Class Reference\relax }{section.3.3}{}}
\newlabel{classBaseSignal_af128ddd50c411d398f9759b6c373bc26}{{3.3}{7}{Public Member Functions\relax }{section*.5}{}}
\@writefile{toc}{\contentsline {section}{\numberline {3.4}Dataflow\discretionary {-}{}{}:\discretionary {-}{}{}:Input$<$ T $>$ Class Template Reference}{7}{section.3.4}}
\newlabel{classDataflow_1_1Input}{{3.4}{7}{Dataflow\-:\-:Input$<$ T $>$ Class Template Reference\relax }{section.3.4}{}}
\newlabel{classDataflow_1_1Input_ac3b9d11161f1d1411ec6a35e5579f027}{{3.4}{7}{Public Member Functions\relax }{section*.6}{}}
\gdef \LT@iv {\LT@entry 
    {1}{123.71086pt}\LT@entry 
    {1}{360.03975pt}}
\gdef \LT@v {\LT@entry 
    {1}{55.42702pt}\LT@entry 
    {1}{77.78368pt}\LT@entry 
    {1}{321.34094pt}}
\@writefile{toc}{\contentsline {subsection}{\numberline {3.4.1}Detailed Description}{8}{subsection.3.4.1}}
\@writefile{toc}{\contentsline {subsection}{\numberline {3.4.2}Member Function Documentation}{8}{subsection.3.4.2}}
\@writefile{toc}{\contentsline {subsubsection}{\numberline {3.4.2.1}check}{8}{subsubsection.3.4.2.1}}
\newlabel{classDataflow_1_1Input_ab9b591d9436b0c2547fff626baa697b3}{{3.4.2.1}{8}{check\relax }{subsubsection.3.4.2.1}{}}
\@writefile{toc}{\contentsline {section}{\numberline {3.5}Dataflow\discretionary {-}{}{}:\discretionary {-}{}{}:Node Class Reference}{8}{section.3.5}}
\newlabel{classDataflow_1_1Node}{{3.5}{8}{Dataflow\-:\-:Node Class Reference\relax }{section.3.5}{}}
\newlabel{classDataflow_1_1Node_a60923efe8eb77fbe57825199308857ef}{{3.5}{8}{Public Member Functions\relax }{section*.8}{}}
\newlabel{classDataflow_1_1Node_ab5d6715b0a943838a4dfcda9e9996b94}{{3.5}{8}{Public Member Functions\relax }{section*.8}{}}
\newlabel{classDataflow_1_1Node_aab45c50c972c12b8a6ece5c9facbb32b}{{3.5}{8}{Data Fields\relax }{section*.9}{}}
\newlabel{classDataflow_1_1Node_af02e022ca48de7a8f07c695bd948a899}{{3.5}{8}{Data Fields\relax }{section*.9}{}}
\newlabel{classDataflow_1_1Node_ac7ec95bd4bf428af7b424fdc1b854a4b}{{3.5}{8}{Data Fields\relax }{section*.9}{}}
\newlabel{classDataflow_1_1Node_ac1d6afdc148fb5a6583f99dfdcab60e8}{{3.5}{8}{Data Fields\relax }{section*.9}{}}
\@writefile{toc}{\contentsline {subsection}{\numberline {3.5.1}Detailed Description}{8}{subsection.3.5.1}}
\@writefile{toc}{\contentsline {section}{\numberline {3.6}Dataflow\discretionary {-}{}{}:\discretionary {-}{}{}:Output$<$ T $>$ Class Template Reference}{9}{section.3.6}}
\newlabel{classDataflow_1_1Output}{{3.6}{9}{Dataflow\-:\-:Output$<$ T $>$ Class Template Reference\relax }{section.3.6}{}}
