\contentsline {chapter}{\numberline {1}Data Structure Index}{1}{chapter.1}
\contentsline {section}{\numberline {1.1}Class Hierarchy}{1}{section.1.1}
\contentsline {chapter}{\numberline {2}Data Structure Index}{3}{chapter.2}
\contentsline {section}{\numberline {2.1}Data Structures}{3}{section.2.1}
\contentsline {chapter}{\numberline {3}Data Structure Documentation}{5}{chapter.3}
\contentsline {section}{\numberline {3.1}Dataflow\discretionary {-}{}{}:\discretionary {-}{}{}:Base\discretionary {-}{}{}Input Class Reference}{5}{section.3.1}
\contentsline {subsection}{\numberline {3.1.1}Detailed Description}{5}{subsection.3.1.1}
\contentsline {subsection}{\numberline {3.1.2}Member Function Documentation}{6}{subsection.3.1.2}
\contentsline {subsubsection}{\numberline {3.1.2.1}bind}{6}{subsubsection.3.1.2.1}
\contentsline {subsubsection}{\numberline {3.1.2.2}check}{6}{subsubsection.3.1.2.2}
\contentsline {subsubsection}{\numberline {3.1.2.3}value}{6}{subsubsection.3.1.2.3}
\contentsline {subsubsection}{\numberline {3.1.2.4}value}{6}{subsubsection.3.1.2.4}
\contentsline {section}{\numberline {3.2}Dataflow\discretionary {-}{}{}:\discretionary {-}{}{}:Base\discretionary {-}{}{}Output Class Reference}{6}{section.3.2}
\contentsline {section}{\numberline {3.3}Base\discretionary {-}{}{}Signal Class Reference}{7}{section.3.3}
\contentsline {section}{\numberline {3.4}Dataflow\discretionary {-}{}{}:\discretionary {-}{}{}:Input$<$ T $>$ Class Template Reference}{7}{section.3.4}
\contentsline {subsection}{\numberline {3.4.1}Detailed Description}{8}{subsection.3.4.1}
\contentsline {subsection}{\numberline {3.4.2}Member Function Documentation}{8}{subsection.3.4.2}
\contentsline {subsubsection}{\numberline {3.4.2.1}check}{8}{subsubsection.3.4.2.1}
\contentsline {section}{\numberline {3.5}Dataflow\discretionary {-}{}{}:\discretionary {-}{}{}:Node Class Reference}{8}{section.3.5}
\contentsline {subsection}{\numberline {3.5.1}Detailed Description}{8}{subsection.3.5.1}
\contentsline {section}{\numberline {3.6}Dataflow\discretionary {-}{}{}:\discretionary {-}{}{}:Output$<$ T $>$ Class Template Reference}{9}{section.3.6}
