<!--This work is licensed under a Creative Commons Attribution-ShareAlike 4.0 International License (CC BY-SA) with Design Exception 1.0-->
<eagle version="7.1.0">
<drawing>
<settings>
<setting alwaysvectorfont="no"/>
<setting verticaltext="up"/>
</settings>
<grid distance="0.1" unitdist="inch" unit="inch" style="lines" multiple="1" display="no" altdistance="0.01" altunitdist="inch" altunit="inch"/>
<layers>
<layer number="1" name="Top" color="4" fill="1" visible="yes" active="yes"/>
<layer number="16" name="Bottom" color="1" fill="1" visible="yes" active="yes"/>
<layer number="17" name="Pads" color="2" fill="1" visible="yes" active="yes"/>
<layer number="18" name="Vias" color="2" fill="1" visible="yes" active="yes"/>
<layer number="19" name="Unrouted" color="6" fill="1" visible="yes" active="yes"/>
<layer number="20" name="Dimension" color="15" fill="1" visible="yes" active="yes"/>
<layer number="21" name="tPlace" color="7" fill="1" visible="yes" active="yes"/>
<layer number="22" name="bPlace" color="7" fill="1" visible="yes" active="yes"/>
<layer number="23" name="tOrigins" color="15" fill="1" visible="yes" active="yes"/>
<layer number="24" name="bOrigins" color="15" fill="1" visible="yes" active="yes"/>
<layer number="25" name="tNames" color="7" fill="1" visible="yes" active="yes"/>
<layer number="26" name="bNames" color="7" fill="1" visible="yes" active="yes"/>
<layer number="27" name="tValues" color="7" fill="1" visible="yes" active="yes"/>
<layer number="28" name="bValues" color="7" fill="1" visible="yes" active="yes"/>
<layer number="29" name="tStop" color="7" fill="3" visible="yes" active="yes"/>
<layer number="30" name="bStop" color="7" fill="6" visible="no" active="yes"/>
<layer number="31" name="tCream" color="7" fill="4" visible="yes" active="yes"/>
<layer number="32" name="bCream" color="7" fill="5" visible="no" active="yes"/>
<layer number="33" name="tFinish" color="6" fill="3" visible="no" active="yes"/>
<layer number="34" name="bFinish" color="6" fill="6" visible="no" active="yes"/>
<layer number="35" name="tGlue" color="7" fill="4" visible="no" active="yes"/>
<layer number="36" name="bGlue" color="7" fill="5" visible="no" active="yes"/>
<layer number="37" name="tTest" color="7" fill="1" visible="no" active="yes"/>
<layer number="38" name="bTest" color="7" fill="1" visible="no" active="yes"/>
<layer number="39" name="tKeepout" color="4" fill="11" visible="yes" active="yes"/>
<layer number="40" name="bKeepout" color="1" fill="11" visible="yes" active="yes"/>
<layer number="41" name="tRestrict" color="4" fill="10" visible="yes" active="yes"/>
<layer number="42" name="bRestrict" color="1" fill="10" visible="yes" active="yes"/>
<layer number="43" name="vRestrict" color="2" fill="10" visible="yes" active="yes"/>
<layer number="44" name="Drills" color="7" fill="1" visible="no" active="yes"/>
<layer number="45" name="Holes" color="7" fill="1" visible="no" active="yes"/>
<layer number="46" name="Milling" color="3" fill="1" visible="no" active="yes"/>
<layer number="47" name="Measures" color="7" fill="1" visible="no" active="yes"/>
<layer number="48" name="Document" color="7" fill="1" visible="yes" active="yes"/>
<layer number="49" name="Reference" color="7" fill="1" visible="yes" active="yes"/>
<layer number="51" name="tDocu" color="7" fill="1" visible="yes" active="yes"/>
<layer number="52" name="bDocu" color="7" fill="1" visible="yes" active="yes"/>
<layer number="90" name="Modules" color="5" fill="1" visible="yes" active="yes"/>
<layer number="91" name="Nets" color="2" fill="1" visible="yes" active="yes"/>
<layer number="92" name="Busses" color="1" fill="1" visible="yes" active="yes"/>
<layer number="93" name="Pins" color="2" fill="1" visible="yes" active="yes"/>
<layer number="94" name="Symbols" color="4" fill="1" visible="yes" active="yes"/>
<layer number="95" name="Names" color="7" fill="1" visible="yes" active="yes"/>
<layer number="96" name="Values" color="7" fill="1" visible="yes" active="yes"/>
<layer number="97" name="Info" color="7" fill="1" visible="yes" active="yes"/>
<layer number="98" name="Guide" color="6" fill="1" visible="yes" active="yes"/>
</layers>
<library>
<packages>
<package name="SOP65P640X120-17N">
<wire x1="-2.2606" y1="2.1336" x2="-2.2606" y2="2.4384" width="0" layer="51"/>
<wire x1="-2.2606" y1="2.4384" x2="-3.302" y2="2.4384" width="0" layer="51"/>
<wire x1="-3.302" y1="2.4384" x2="-3.302" y2="2.1336" width="0" layer="51"/>
<wire x1="-3.302" y1="2.1336" x2="-2.2606" y2="2.1336" width="0" layer="51"/>
<wire x1="-2.2606" y1="1.4732" x2="-2.2606" y2="1.778" width="0" layer="51"/>
<wire x1="-2.2606" y1="1.778" x2="-3.302" y2="1.778" width="0" layer="51"/>
<wire x1="-3.302" y1="1.778" x2="-3.302" y2="1.4732" width="0" layer="51"/>
<wire x1="-3.302" y1="1.4732" x2="-2.2606" y2="1.4732" width="0" layer="51"/>
<wire x1="-2.2606" y1="0.8128" x2="-2.2606" y2="1.1176" width="0" layer="51"/>
<wire x1="-2.2606" y1="1.1176" x2="-3.302" y2="1.1176" width="0" layer="51"/>
<wire x1="-3.302" y1="1.1176" x2="-3.302" y2="0.8128" width="0" layer="51"/>
<wire x1="-3.302" y1="0.8128" x2="-2.2606" y2="0.8128" width="0" layer="51"/>
<wire x1="-2.2606" y1="0.1778" x2="-2.2606" y2="0.4826" width="0" layer="51"/>
<wire x1="-2.2606" y1="0.4826" x2="-3.302" y2="0.4826" width="0" layer="51"/>
<wire x1="-3.302" y1="0.4826" x2="-3.302" y2="0.1778" width="0" layer="51"/>
<wire x1="-3.302" y1="0.1778" x2="-2.2606" y2="0.1778" width="0" layer="51"/>
<wire x1="-2.2606" y1="-0.4826" x2="-2.2606" y2="-0.1778" width="0" layer="51"/>
<wire x1="-2.2606" y1="-0.1778" x2="-3.302" y2="-0.1778" width="0" layer="51"/>
<wire x1="-3.302" y1="-0.1778" x2="-3.302" y2="-0.4826" width="0" layer="51"/>
<wire x1="-3.302" y1="-0.4826" x2="-2.2606" y2="-0.4826" width="0" layer="51"/>
<wire x1="-2.2606" y1="-1.1176" x2="-2.2606" y2="-0.8128" width="0" layer="51"/>
<wire x1="-2.2606" y1="-0.8128" x2="-3.302" y2="-0.8128" width="0" layer="51"/>
<wire x1="-3.302" y1="-0.8128" x2="-3.302" y2="-1.1176" width="0" layer="51"/>
<wire x1="-3.302" y1="-1.1176" x2="-2.2606" y2="-1.1176" width="0" layer="51"/>
<wire x1="-2.2606" y1="-1.778" x2="-2.2606" y2="-1.4732" width="0" layer="51"/>
<wire x1="-2.2606" y1="-1.4732" x2="-3.302" y2="-1.4732" width="0" layer="51"/>
<wire x1="-3.302" y1="-1.4732" x2="-3.302" y2="-1.778" width="0" layer="51"/>
<wire x1="-3.302" y1="-1.778" x2="-2.2606" y2="-1.778" width="0" layer="51"/>
<wire x1="-2.2606" y1="-2.4384" x2="-2.2606" y2="-2.1336" width="0" layer="51"/>
<wire x1="-2.2606" y1="-2.1336" x2="-3.302" y2="-2.1336" width="0" layer="51"/>
<wire x1="-3.302" y1="-2.1336" x2="-3.302" y2="-2.4384" width="0" layer="51"/>
<wire x1="-3.302" y1="-2.4384" x2="-2.2606" y2="-2.4384" width="0" layer="51"/>
<wire x1="2.2606" y1="-2.1336" x2="2.2606" y2="-2.4384" width="0" layer="51"/>
<wire x1="2.2606" y1="-2.4384" x2="3.302" y2="-2.4384" width="0" layer="51"/>
<wire x1="3.302" y1="-2.4384" x2="3.302" y2="-2.1336" width="0" layer="51"/>
<wire x1="3.302" y1="-2.1336" x2="2.2606" y2="-2.1336" width="0" layer="51"/>
<wire x1="2.2606" y1="-1.4732" x2="2.2606" y2="-1.778" width="0" layer="51"/>
<wire x1="2.2606" y1="-1.778" x2="3.302" y2="-1.778" width="0" layer="51"/>
<wire x1="3.302" y1="-1.778" x2="3.302" y2="-1.4732" width="0" layer="51"/>
<wire x1="3.302" y1="-1.4732" x2="2.2606" y2="-1.4732" width="0" layer="51"/>
<wire x1="2.2606" y1="-0.8128" x2="2.2606" y2="-1.1176" width="0" layer="51"/>
<wire x1="2.2606" y1="-1.1176" x2="3.302" y2="-1.1176" width="0" layer="51"/>
<wire x1="3.302" y1="-1.1176" x2="3.302" y2="-0.8128" width="0" layer="51"/>
<wire x1="3.302" y1="-0.8128" x2="2.2606" y2="-0.8128" width="0" layer="51"/>
<wire x1="2.2606" y1="-0.1778" x2="2.2606" y2="-0.4826" width="0" layer="51"/>
<wire x1="2.2606" y1="-0.4826" x2="3.302" y2="-0.4826" width="0" layer="51"/>
<wire x1="3.302" y1="-0.4826" x2="3.302" y2="-0.1778" width="0" layer="51"/>
<wire x1="3.302" y1="-0.1778" x2="2.2606" y2="-0.1778" width="0" layer="51"/>
<wire x1="2.2606" y1="0.4826" x2="2.2606" y2="0.1778" width="0" layer="51"/>
<wire x1="2.2606" y1="0.1778" x2="3.302" y2="0.1778" width="0" layer="51"/>
<wire x1="3.302" y1="0.1778" x2="3.302" y2="0.4826" width="0" layer="51"/>
<wire x1="3.302" y1="0.4826" x2="2.2606" y2="0.4826" width="0" layer="51"/>
<wire x1="2.2606" y1="1.1176" x2="2.2606" y2="0.8128" width="0" layer="51"/>
<wire x1="2.2606" y1="0.8128" x2="3.302" y2="0.8128" width="0" layer="51"/>
<wire x1="3.302" y1="0.8128" x2="3.302" y2="1.1176" width="0" layer="51"/>
<wire x1="3.302" y1="1.1176" x2="2.2606" y2="1.1176" width="0" layer="51"/>
<wire x1="2.2606" y1="1.778" x2="2.2606" y2="1.4732" width="0" layer="51"/>
<wire x1="2.2606" y1="1.4732" x2="3.302" y2="1.4732" width="0" layer="51"/>
<wire x1="3.302" y1="1.4732" x2="3.302" y2="1.778" width="0" layer="51"/>
<wire x1="3.302" y1="1.778" x2="2.2606" y2="1.778" width="0" layer="51"/>
<wire x1="2.2606" y1="2.4384" x2="2.2606" y2="2.1336" width="0" layer="51"/>
<wire x1="2.2606" y1="2.1336" x2="3.302" y2="2.1336" width="0" layer="51"/>
<wire x1="3.302" y1="2.1336" x2="3.302" y2="2.4384" width="0" layer="51"/>
<wire x1="3.302" y1="2.4384" x2="2.2606" y2="2.4384" width="0" layer="51"/>
<wire x1="-2.2606" y1="-2.54" x2="2.2606" y2="-2.54" width="0" layer="51"/>
<wire x1="2.2606" y1="-2.54" x2="2.2606" y2="2.54" width="0" layer="51"/>
<wire x1="2.2606" y1="2.54" x2="0.3048" y2="2.54" width="0" layer="51"/>
<wire x1="0.3048" y1="2.54" x2="-0.3048" y2="2.54" width="0" layer="51"/>
<wire x1="-0.3048" y1="2.54" x2="-2.2606" y2="2.54" width="0" layer="51"/>
<wire x1="-2.2606" y1="2.54" x2="-2.2606" y2="-2.54" width="0" layer="51"/>
<wire x1="0.3048" y1="2.54" x2="-0.3048" y2="2.54" width="0" layer="51" curve="-180"/>
<wire x1="-1.8796" y1="-2.54" x2="1.8796" y2="-2.54" width="0.1524" layer="21"/>
<wire x1="1.8796" y1="2.54" x2="0.3048" y2="2.54" width="0.1524" layer="21"/>
<wire x1="0.3048" y1="2.54" x2="-0.3048" y2="2.54" width="0.1524" layer="21"/>
<wire x1="-0.3048" y1="2.54" x2="-1.8796" y2="2.54" width="0.1524" layer="21"/>
<wire x1="0.3048" y1="2.54" x2="-0.3048" y2="2.54" width="0.1524" layer="21" curve="-180"/>
<text x="-3.45467" y="3.17524" size="2.08296" layer="25" ratio="10" rot="SR0">&gt;NAME</text>
<text x="-3.45688" y="-5.08365" size="2.08429" layer="27" ratio="10" rot="SR0">&gt;VALUE</text>
<smd name="1" x="-2.921" y="2.286" dx="1.4732" dy="0.3556" layer="1"/>
<smd name="2" x="-2.921" y="1.6256" dx="1.4732" dy="0.3556" layer="1"/>
<smd name="3" x="-2.921" y="0.9652" dx="1.4732" dy="0.3556" layer="1"/>
<smd name="4" x="-2.921" y="0.3302" dx="1.4732" dy="0.3556" layer="1"/>
<smd name="5" x="-2.921" y="-0.3302" dx="1.4732" dy="0.3556" layer="1"/>
<smd name="6" x="-2.921" y="-0.9652" dx="1.4732" dy="0.3556" layer="1"/>
<smd name="7" x="-2.921" y="-1.6256" dx="1.4732" dy="0.3556" layer="1"/>
<smd name="8" x="-2.921" y="-2.286" dx="1.4732" dy="0.3556" layer="1"/>
<smd name="9" x="2.921" y="-2.286" dx="1.4732" dy="0.3556" layer="1"/>
<smd name="10" x="2.921" y="-1.6256" dx="1.4732" dy="0.3556" layer="1"/>
<smd name="11" x="2.921" y="-0.9652" dx="1.4732" dy="0.3556" layer="1"/>
<smd name="12" x="2.921" y="-0.3302" dx="1.4732" dy="0.3556" layer="1"/>
<smd name="13" x="2.921" y="0.3302" dx="1.4732" dy="0.3556" layer="1"/>
<smd name="14" x="2.921" y="0.9652" dx="1.4732" dy="0.3556" layer="1"/>
<smd name="15" x="2.921" y="1.6256" dx="1.4732" dy="0.3556" layer="1"/>
<smd name="16" x="2.921" y="2.286" dx="1.4732" dy="0.3556" layer="1"/>
<smd name="17" x="0" y="0" dx="2.9972" dy="2.9972" layer="1"/>
</package>
</packages>
<symbols>
<symbol name="DRV8800PWPR">
<wire x1="-12.7" y1="25.4" x2="-12.7" y2="-30.48" width="0.4064" layer="94"/>
<wire x1="-12.7" y1="-30.48" x2="12.7" y2="-30.48" width="0.4064" layer="94"/>
<wire x1="12.7" y1="-30.48" x2="12.7" y2="25.4" width="0.4064" layer="94"/>
<wire x1="12.7" y1="25.4" x2="-12.7" y2="25.4" width="0.4064" layer="94"/>
<text x="-5.36986" y="29.4961" size="2.08687" layer="95" ratio="10" rot="SR0">&gt;NAME</text>
<text x="-2.54108" y="-36.2612" size="2.08369" layer="96" ratio="10" rot="SR0">&gt;VALUE</text>
<pin name="VBB" x="-17.78" y="20.32" length="middle" direction="pwr"/>
<pin name="ENABLE" x="-17.78" y="15.24" length="middle" direction="in"/>
<pin name="SENSE" x="-17.78" y="12.7" length="middle" direction="in"/>
<pin name="NSLEEP" x="-17.78" y="10.16" length="middle" direction="in"/>
<pin name="MODE" x="-17.78" y="7.62" length="middle" direction="in"/>
<pin name="PHASE" x="-17.78" y="5.08" length="middle" direction="in"/>
<pin name="CP1" x="-17.78" y="0" length="middle" direction="pas"/>
<pin name="CP2" x="-17.78" y="-2.54" length="middle" direction="pas"/>
<pin name="VCP" x="-17.78" y="-7.62" length="middle" direction="pas"/>
<pin name="VREG" x="-17.78" y="-10.16" length="middle" direction="pas"/>
<pin name="NC" x="-17.78" y="-15.24" length="middle" direction="nc"/>
<pin name="EPAD" x="-17.78" y="-17.78" length="middle" direction="pas"/>
<pin name="GND_2" x="-17.78" y="-22.86" length="middle" direction="pas"/>
<pin name="GND" x="-17.78" y="-25.4" length="middle" direction="pas"/>
<pin name="NFAULT" x="17.78" y="20.32" length="middle" direction="out" rot="R180"/>
<pin name="OUT+" x="17.78" y="17.78" length="middle" direction="out" rot="R180"/>
<pin name="OUT-" x="17.78" y="15.24" length="middle" direction="out" rot="R180"/>
</symbol>
</symbols>
<devicesets>
<deviceset name="DRV8800PWPR" prefix="U">
<description>DMOS FULL-BRIDGE MOTOR DRIVERS</description>
<gates>
<gate name="A" symbol="DRV8800PWPR" x="0" y="0"/>
</gates>
<devices>
<device name="" package="SOP65P640X120-17N">
<connects>
<connect gate="A" pin="CP1" pad="11"/>
<connect gate="A" pin="CP2" pad="12"/>
<connect gate="A" pin="ENABLE" pad="6"/>
<connect gate="A" pin="EPAD" pad="17"/>
<connect gate="A" pin="GND" pad="13"/>
<connect gate="A" pin="GND_2" pad="4"/>
<connect gate="A" pin="MODE" pad="2"/>
<connect gate="A" pin="NC" pad="16"/>
<connect gate="A" pin="NFAULT" pad="1"/>
<connect gate="A" pin="NSLEEP" pad="5"/>
<connect gate="A" pin="OUT+" pad="7"/>
<connect gate="A" pin="OUT-" pad="10"/>
<connect gate="A" pin="PHASE" pad="3"/>
<connect gate="A" pin="SENSE" pad="8"/>
<connect gate="A" pin="VBB" pad="9"/>
<connect gate="A" pin="VCP" pad="14"/>
<connect gate="A" pin="VREG" pad="15"/>
</connects>
<technologies>
<technology name="">
<attribute name="Package" value="HTSSOP-16 Texas Instruments"/>
<attribute name="MP" value="DRV8800PWPR"/>
<attribute name="Description" value="
Bipolar Motor Driver DMOS Parallel 16-HTSSOP
"/>
<attribute name="Digi-Key_Purchase_URL" value="https://www.digikey.ca/product-detail/en/texas-instruments/DRV8800PWPR/296-25377-1-ND/2183148?utm_source=snapeda&amp;utm_medium=aggregator&amp;utm_campaign=symbol"/>
<attribute name="MF" value="Texas Instruments"/>
<attribute name="Digi-Key_Part_Number" value="296-25377-1-ND"/>
</technology>
</technologies>
</device>
</devices>
</deviceset>
</devicesets>
</library>
</drawing>
</eagle>
