{
  "using": "xpath",
  "value": "//*[@id=\"app\"]/div/div/div/div/div/div[4]/div[1]/div[3]/div/div/div/div/div/div[1]/div[2]/div[2]/div/div[2]/div/div/div[2]/div[2]/div/div[16]/div/div[3]/div/div/label/div"
}