[
  {
    "element-6066-11e4-a52e-4f735466cecf": "55697c35-cba3-46e9-8a90-86d7a8ef62e7"
  },
  {
    "element-6066-11e4-a52e-4f735466cecf": "11406e2d-5dd0-4389-aef6-cc5c7a975d96"
  },
  {
    "element-6066-11e4-a52e-4f735466cecf": "7d420a64-ff0e-44ac-b334-42a3010ee507"
  },
  {
    "element-6066-11e4-a52e-4f735466cecf": "46013527-1bcc-4043-8ac9-e9ef6649d0be"
  },
  {
    "element-6066-11e4-a52e-4f735466cecf": "a0815a05-7194-4d1a-9733-58d2925236f4"
  },
  {
    "element-6066-11e4-a52e-4f735466cecf": "44e5e087-b6d4-4269-9316-e2f3f39be688"
  },
  {
    "element-6066-11e4-a52e-4f735466cecf": "c724ee18-4b89-4c29-b9e3-63899719d509"
  },
  {
    "element-6066-11e4-a52e-4f735466cecf": "cb4ad627-ad57-44ac-ac5b-e3f142de0bca"
  },
  {
    "element-6066-11e4-a52e-4f735466cecf": "c7f7d885-13c1-4063-925f-9fc14f37ce46"
  },
  {
    "element-6066-11e4-a52e-4f735466cecf": "8df28d87-0ef3-47cf-ab04-9ef6faf2e3b1"
  },
  {
    "element-6066-11e4-a52e-4f735466cecf": "b97c8cfc-047a-4cc5-ac5b-074f86c14ed2"
  },
  {
    "element-6066-11e4-a52e-4f735466cecf": "afb91400-8e80-492e-a8cb-a773d59a4773"
  }
]