[
  {
    "element-6066-11e4-a52e-4f735466cecf": "564d401b-a1f9-47c4-a017-f16ca8639c24"
  },
  {
    "element-6066-11e4-a52e-4f735466cecf": "d3de81c6-ffb8-4591-aeab-74f4e5e55eea"
  },
  {
    "element-6066-11e4-a52e-4f735466cecf": "2a5cfa5d-2410-4779-840d-29be974dd846"
  },
  {
    "element-6066-11e4-a52e-4f735466cecf": "b584caa6-4046-49cf-8df1-f1a82cbbe35e"
  },
  {
    "element-6066-11e4-a52e-4f735466cecf": "76fe96ba-524f-42dc-9986-1d106383570d"
  },
  {
    "element-6066-11e4-a52e-4f735466cecf": "ee95ab03-c45f-4b3d-adbc-b225286245b4"
  },
  {
    "element-6066-11e4-a52e-4f735466cecf": "4a8baa54-e63c-40d9-8885-0a1a6aa490a4"
  },
  {
    "element-6066-11e4-a52e-4f735466cecf": "aef0fb8d-33a1-49d9-b26f-111180d9b3da"
  },
  {
    "element-6066-11e4-a52e-4f735466cecf": "cb57387c-058c-4b6e-a592-ea43ccdaa989"
  },
  {
    "element-6066-11e4-a52e-4f735466cecf": "073761bd-3dd1-4137-a2ba-73c473a7cdf5"
  },
  {
    "element-6066-11e4-a52e-4f735466cecf": "4f584d77-4521-4b90-8814-6a5dfc8ab585"
  }
]