{
  "88ba5f5b81139df2e7dc5f6bbaad7b2c" : {
    "statistic" : {
      "failed" : 0,
      "broken" : 0,
      "skipped" : 0,
      "passed" : 1,
      "unknown" : 0,
      "total" : 1
    },
    "items" : [ {
      "uid" : "ecbd57f9a70ae21d",
      "status" : "passed",
      "time" : {
        "start" : 1609832854869,
        "stop" : 1609832859778,
        "duration" : 4909
      }
    } ]
  },
  "369437c1bef39de5c4a6c3fb7f691ddc" : {
    "statistic" : {
      "failed" : 0,
      "broken" : 0,
      "skipped" : 0,
      "passed" : 1,
      "unknown" : 0,
      "total" : 1
    },
    "items" : [ {
      "uid" : "ab3975e278756709",
      "status" : "passed",
      "time" : {
        "start" : 1609832882225,
        "stop" : 1609832884043,
        "duration" : 1818
      }
    } ]
  },
  "13d22ef89cdb7d86c3ffc48abeeb57af" : {
    "statistic" : {
      "failed" : 0,
      "broken" : 0,
      "skipped" : 0,
      "passed" : 1,
      "unknown" : 0,
      "total" : 1
    },
    "items" : [ {
      "uid" : "7eca39015b1f7d60",
      "status" : "passed",
      "time" : {
        "start" : 1609832911183,
        "stop" : 1609832912987,
        "duration" : 1804
      }
    } ]
  },
  "1d04aa55b49d0eecae352983d86181d0" : {
    "statistic" : {
      "failed" : 0,
      "broken" : 0,
      "skipped" : 0,
      "passed" : 1,
      "unknown" : 0,
      "total" : 1
    },
    "items" : [ {
      "uid" : "ccca5e16a2701538",
      "status" : "passed",
      "time" : {
        "start" : 1609832845172,
        "stop" : 1609832848011,
        "duration" : 2839
      }
    } ]
  },
  "57ecd9b3c64156dc8c4a18f02b22443f" : {
    "statistic" : {
      "failed" : 0,
      "broken" : 0,
      "skipped" : 0,
      "passed" : 1,
      "unknown" : 0,
      "total" : 1
    },
    "items" : [ {
      "uid" : "ca7ded3f3e5354fa",
      "status" : "passed",
      "time" : {
        "start" : 1609832836115,
        "stop" : 1609832841875,
        "duration" : 5760
      }
    } ]
  },
  "41999e2fc7dcd4d6ce998205f42e411e" : {
    "statistic" : {
      "failed" : 0,
      "broken" : 0,
      "skipped" : 0,
      "passed" : 1,
      "unknown" : 0,
      "total" : 1
    },
    "items" : [ {
      "uid" : "28de24074393e0df",
      "status" : "passed",
      "time" : {
        "start" : 1609832842047,
        "stop" : 1609832842048,
        "duration" : 1
      }
    } ]
  },
  "3305bb848a71e01962a7c6bf0936bf0f" : {
    "statistic" : {
      "failed" : 0,
      "broken" : 0,
      "skipped" : 0,
      "passed" : 1,
      "unknown" : 0,
      "total" : 1
    },
    "items" : [ {
      "uid" : "ec8788f7e26a0120",
      "status" : "passed",
      "time" : {
        "start" : 1609832876486,
        "stop" : 1609832876486,
        "duration" : 0
      }
    } ]
  },
  "1c7fb1927192f45ba360ef3d0419c61b" : {
    "statistic" : {
      "failed" : 0,
      "broken" : 0,
      "skipped" : 0,
      "passed" : 1,
      "unknown" : 0,
      "total" : 1
    },
    "items" : [ {
      "uid" : "b09caf5b64f71d6",
      "status" : "passed",
      "time" : {
        "start" : 1609832882219,
        "stop" : 1609832882219,
        "duration" : 0
      }
    } ]
  },
  "92d7d633ebf6e4972e48e5420430d27a" : {
    "statistic" : {
      "failed" : 0,
      "broken" : 0,
      "skipped" : 0,
      "passed" : 1,
      "unknown" : 0,
      "total" : 1
    },
    "items" : [ {
      "uid" : "bb9734e76ed119d",
      "status" : "passed",
      "time" : {
        "start" : 1609832896597,
        "stop" : 1609832899112,
        "duration" : 2515
      }
    } ]
  },
  "fbfed1b7212daf7a0a5ec7b9a082f6e1" : {
    "statistic" : {
      "failed" : 0,
      "broken" : 0,
      "skipped" : 0,
      "passed" : 1,
      "unknown" : 0,
      "total" : 1
    },
    "items" : [ {
      "uid" : "5bffd294b1e0a4bc",
      "status" : "passed",
      "time" : {
        "start" : 1609832876438,
        "stop" : 1609832876486,
        "duration" : 48
      }
    } ]
  },
  "dfb43f7cd98c6966519351b96d67ee97" : {
    "statistic" : {
      "failed" : 0,
      "broken" : 0,
      "skipped" : 0,
      "passed" : 1,
      "unknown" : 0,
      "total" : 1
    },
    "items" : [ {
      "uid" : "797b1c3fb5731f4f",
      "status" : "passed",
      "time" : {
        "start" : 1609832899143,
        "stop" : 1609832902657,
        "duration" : 3514
      }
    } ]
  },
  "687c49bf1874648136c982c49f839ccb" : {
    "statistic" : {
      "failed" : 0,
      "broken" : 0,
      "skipped" : 0,
      "passed" : 1,
      "unknown" : 0,
      "total" : 1
    },
    "items" : [ {
      "uid" : "e7b109b86716a8f0",
      "status" : "passed",
      "time" : {
        "start" : 1609832911158,
        "stop" : 1609832911178,
        "duration" : 20
      }
    } ]
  },
  "1f9256b60abb9b9c450b6bb92de79814" : {
    "statistic" : {
      "failed" : 0,
      "broken" : 0,
      "skipped" : 0,
      "passed" : 1,
      "unknown" : 0,
      "total" : 1
    },
    "items" : [ {
      "uid" : "6d09d2f006f72f71",
      "status" : "passed",
      "time" : {
        "start" : 1609832873310,
        "stop" : 1609832876437,
        "duration" : 3127
      }
    } ]
  },
  "ac8b4cf2d7f3933cd7352bc813760405" : {
    "statistic" : {
      "failed" : 0,
      "broken" : 0,
      "skipped" : 0,
      "passed" : 1,
      "unknown" : 0,
      "total" : 1
    },
    "items" : [ {
      "uid" : "60f31701f068418c",
      "status" : "passed",
      "time" : {
        "start" : 1609832893354,
        "stop" : 1609832893354,
        "duration" : 0
      }
    } ]
  },
  "31acfe8ae6cdb8a5dd71e58b8e840765" : {
    "statistic" : {
      "failed" : 0,
      "broken" : 0,
      "skipped" : 0,
      "passed" : 1,
      "unknown" : 0,
      "total" : 1
    },
    "items" : [ {
      "uid" : "a5b511fb61f8fa72",
      "status" : "passed",
      "time" : {
        "start" : 1609832917243,
        "stop" : 1609832917243,
        "duration" : 0
      }
    } ]
  },
  "5dcbf77a12bc6d715fdc15d3f5f7a4e1" : {
    "statistic" : {
      "failed" : 0,
      "broken" : 0,
      "skipped" : 0,
      "passed" : 1,
      "unknown" : 0,
      "total" : 1
    },
    "items" : [ {
      "uid" : "797fa65aa4f44847",
      "status" : "passed",
      "time" : {
        "start" : 1609832868106,
        "stop" : 1609832871394,
        "duration" : 3288
      }
    } ]
  },
  "a8ab06cfb63b881bf960f92a2b6f25e1" : {
    "statistic" : {
      "failed" : 0,
      "broken" : 0,
      "skipped" : 0,
      "passed" : 1,
      "unknown" : 0,
      "total" : 1
    },
    "items" : [ {
      "uid" : "35396dc55a17640d",
      "status" : "passed",
      "time" : {
        "start" : 1609832876494,
        "stop" : 1609832878322,
        "duration" : 1828
      }
    } ]
  },
  "d7fd43b13983f2147dede39b465777df" : {
    "statistic" : {
      "failed" : 0,
      "broken" : 0,
      "skipped" : 0,
      "passed" : 1,
      "unknown" : 0,
      "total" : 1
    },
    "items" : [ {
      "uid" : "dc0cd51910dc883d",
      "status" : "passed",
      "time" : {
        "start" : 1609832866326,
        "stop" : 1609832866327,
        "duration" : 1
      }
    } ]
  },
  "10ab61730774336831549803e8911af6" : {
    "statistic" : {
      "failed" : 0,
      "broken" : 0,
      "skipped" : 0,
      "passed" : 1,
      "unknown" : 0,
      "total" : 1
    },
    "items" : [ {
      "uid" : "28d4c35b681edda4",
      "status" : "passed",
      "time" : {
        "start" : 1609832849884,
        "stop" : 1609832853070,
        "duration" : 3186
      }
    } ]
  },
  "d9962d274c2a7588e234140d347e208d" : {
    "statistic" : {
      "failed" : 0,
      "broken" : 0,
      "skipped" : 0,
      "passed" : 1,
      "unknown" : 0,
      "total" : 1
    },
    "items" : [ {
      "uid" : "9294bc258100f0fa",
      "status" : "passed",
      "time" : {
        "start" : 1609832893362,
        "stop" : 1609832896597,
        "duration" : 3235
      }
    } ]
  },
  "1ae460ced5dd6d30bb976f87ccec84e" : {
    "statistic" : {
      "failed" : 0,
      "broken" : 0,
      "skipped" : 0,
      "passed" : 1,
      "unknown" : 0,
      "total" : 1
    },
    "items" : [ {
      "uid" : "ac73e1d804c64e64",
      "status" : "passed",
      "time" : {
        "start" : 1609832861522,
        "stop" : 1609832866299,
        "duration" : 4777
      }
    } ]
  },
  "89da49c07acea393317849cb27de7bba" : {
    "statistic" : {
      "failed" : 0,
      "broken" : 0,
      "skipped" : 0,
      "passed" : 1,
      "unknown" : 0,
      "total" : 1
    },
    "items" : [ {
      "uid" : "bbfd51db6576a882",
      "status" : "passed",
      "time" : {
        "start" : 1609832871394,
        "stop" : 1609832871418,
        "duration" : 24
      }
    } ]
  },
  "dbb2bd8bff964dc320f94c924b3df94c" : {
    "statistic" : {
      "failed" : 0,
      "broken" : 0,
      "skipped" : 0,
      "passed" : 1,
      "unknown" : 0,
      "total" : 1
    },
    "items" : [ {
      "uid" : "e5243e6415c3a213",
      "status" : "passed",
      "time" : {
        "start" : 1609832859778,
        "stop" : 1609832859801,
        "duration" : 23
      }
    } ]
  },
  "d3c17de1569d35dfe40e3a008ede552b" : {
    "statistic" : {
      "failed" : 0,
      "broken" : 0,
      "skipped" : 0,
      "passed" : 1,
      "unknown" : 0,
      "total" : 1
    },
    "items" : [ {
      "uid" : "3da68025b4cc0f29",
      "status" : "passed",
      "time" : {
        "start" : 1609832884043,
        "stop" : 1609832887934,
        "duration" : 3891
      }
    } ]
  },
  "efd57ee775eec51cd33735e48711bb9e" : {
    "statistic" : {
      "failed" : 0,
      "broken" : 0,
      "skipped" : 0,
      "passed" : 1,
      "unknown" : 0,
      "total" : 1
    },
    "items" : [ {
      "uid" : "c82eacdf1eae935f",
      "status" : "passed",
      "time" : {
        "start" : 1609832871428,
        "stop" : 1609832873310,
        "duration" : 1882
      }
    } ]
  },
  "7aa644222bb1ce97e4f6f4495d1f8f08" : {
    "statistic" : {
      "failed" : 0,
      "broken" : 0,
      "skipped" : 0,
      "passed" : 1,
      "unknown" : 0,
      "total" : 1
    },
    "items" : [ {
      "uid" : "e080b2fa11525bd2",
      "status" : "passed",
      "time" : {
        "start" : 1609832829232,
        "stop" : 1609832836115,
        "duration" : 6883
      }
    } ]
  },
  "79c90e65e0498845e9c94f7021326762" : {
    "statistic" : {
      "failed" : 0,
      "broken" : 0,
      "skipped" : 0,
      "passed" : 1,
      "unknown" : 0,
      "total" : 1
    },
    "items" : [ {
      "uid" : "d0807f74e8bdce08",
      "status" : "passed",
      "time" : {
        "start" : 1609832866299,
        "stop" : 1609832866326,
        "duration" : 27
      }
    } ]
  },
  "e20921b4afc6e24cab56679521988e57" : {
    "statistic" : {
      "failed" : 0,
      "broken" : 0,
      "skipped" : 0,
      "passed" : 1,
      "unknown" : 0,
      "total" : 1
    },
    "items" : [ {
      "uid" : "a1bc70f7a2ff1aa1",
      "status" : "passed",
      "time" : {
        "start" : 1609832899138,
        "stop" : 1609832899138,
        "duration" : 0
      }
    } ]
  },
  "65bb5993f54f74c967e1727f7560162" : {
    "statistic" : {
      "failed" : 0,
      "broken" : 0,
      "skipped" : 0,
      "passed" : 1,
      "unknown" : 0,
      "total" : 1
    },
    "items" : [ {
      "uid" : "154451f49dccea62",
      "status" : "passed",
      "time" : {
        "start" : 1609832905784,
        "stop" : 1609832905907,
        "duration" : 123
      }
    } ]
  },
  "22df90774623c81147044b16937fede0" : {
    "statistic" : {
      "failed" : 0,
      "broken" : 0,
      "skipped" : 0,
      "passed" : 1,
      "unknown" : 0,
      "total" : 1
    },
    "items" : [ {
      "uid" : "dafbb65a80444327",
      "status" : "passed",
      "time" : {
        "start" : 1609832866333,
        "stop" : 1609832868106,
        "duration" : 1773
      }
    } ]
  },
  "6be8e2f1a485210d69b586837f158bcc" : {
    "statistic" : {
      "failed" : 0,
      "broken" : 0,
      "skipped" : 0,
      "passed" : 1,
      "unknown" : 0,
      "total" : 1
    },
    "items" : [ {
      "uid" : "993ea8268aef7864",
      "status" : "passed",
      "time" : {
        "start" : 1609832848135,
        "stop" : 1609832849884,
        "duration" : 1749
      }
    } ]
  },
  "32f8414fff8e75d516e74910f20f233b" : {
    "statistic" : {
      "failed" : 0,
      "broken" : 0,
      "skipped" : 0,
      "passed" : 1,
      "unknown" : 0,
      "total" : 1
    },
    "items" : [ {
      "uid" : "ca9124d255ed0a64",
      "status" : "passed",
      "time" : {
        "start" : 1609832871419,
        "stop" : 1609832871419,
        "duration" : 0
      }
    } ]
  },
  "43d8601d23a3d938e4727324e58c612c" : {
    "statistic" : {
      "failed" : 0,
      "broken" : 0,
      "skipped" : 0,
      "passed" : 1,
      "unknown" : 0,
      "total" : 1
    },
    "items" : [ {
      "uid" : "fcb6cd8cc13b8fec",
      "status" : "passed",
      "time" : {
        "start" : 1609832859807,
        "stop" : 1609832861522,
        "duration" : 1715
      }
    } ]
  },
  "d5cbcf873eaecde170b2a0609c4f3d0e" : {
    "statistic" : {
      "failed" : 0,
      "broken" : 0,
      "skipped" : 0,
      "passed" : 1,
      "unknown" : 0,
      "total" : 1
    },
    "items" : [ {
      "uid" : "dfeaec279789331e",
      "status" : "passed",
      "time" : {
        "start" : 1609832889718,
        "stop" : 1609832893331,
        "duration" : 3613
      }
    } ]
  },
  "857bf5ee2041cd0ce4e52e9cba5e6c6e" : {
    "statistic" : {
      "failed" : 0,
      "broken" : 0,
      "skipped" : 0,
      "passed" : 1,
      "unknown" : 0,
      "total" : 1
    },
    "items" : [ {
      "uid" : "a6798079cdb72ac3",
      "status" : "passed",
      "time" : {
        "start" : 1609832859801,
        "stop" : 1609832859801,
        "duration" : 0
      }
    } ]
  },
  "ec296f63854ead243d8245d65b35795" : {
    "statistic" : {
      "failed" : 0,
      "broken" : 0,
      "skipped" : 0,
      "passed" : 1,
      "unknown" : 0,
      "total" : 1
    },
    "items" : [ {
      "uid" : "be20cfeb5d2802e0",
      "status" : "passed",
      "time" : {
        "start" : 1609832853098,
        "stop" : 1609832853098,
        "duration" : 0
      }
    } ]
  },
  "66edc30ab6e1d9c28b9f02b67fd9f251" : {
    "statistic" : {
      "failed" : 0,
      "broken" : 0,
      "skipped" : 0,
      "passed" : 1,
      "unknown" : 0,
      "total" : 1
    },
    "items" : [ {
      "uid" : "358bf3116baa5f7a",
      "status" : "passed",
      "time" : {
        "start" : 1609832905907,
        "stop" : 1609832905907,
        "duration" : 0
      }
    } ]
  },
  "b19d2774cd6c3e2395d4da8caf346118" : {
    "statistic" : {
      "failed" : 0,
      "broken" : 0,
      "skipped" : 0,
      "passed" : 1,
      "unknown" : 0,
      "total" : 1
    },
    "items" : [ {
      "uid" : "4a7fd8f76818cc01",
      "status" : "passed",
      "time" : {
        "start" : 1609832902657,
        "stop" : 1609832905784,
        "duration" : 3127
      }
    } ]
  },
  "113481d1f01402bfe603e5d5fa659d89" : {
    "statistic" : {
      "failed" : 0,
      "broken" : 0,
      "skipped" : 0,
      "passed" : 1,
      "unknown" : 0,
      "total" : 1
    },
    "items" : [ {
      "uid" : "e9bb31f94b6a1923",
      "status" : "passed",
      "time" : {
        "start" : 1609832841875,
        "stop" : 1609832842047,
        "duration" : 172
      }
    } ]
  },
  "c70e0219ef0e32405abcf864ccc5b26e" : {
    "statistic" : {
      "failed" : 0,
      "broken" : 0,
      "skipped" : 0,
      "passed" : 1,
      "unknown" : 0,
      "total" : 1
    },
    "items" : [ {
      "uid" : "16222d8cd8b937cf",
      "status" : "passed",
      "time" : {
        "start" : 1609832912987,
        "stop" : 1609832917223,
        "duration" : 4236
      }
    } ]
  },
  "bc961b842bb418e99ad025ab984a7b4" : {
    "statistic" : {
      "failed" : 0,
      "broken" : 0,
      "skipped" : 0,
      "passed" : 1,
      "unknown" : 0,
      "total" : 1
    },
    "items" : [ {
      "uid" : "188c57d693377caf",
      "status" : "passed",
      "time" : {
        "start" : 1609832853104,
        "stop" : 1609832854869,
        "duration" : 1765
      }
    } ]
  },
  "45feae77596bcd43ef589a406e2dcfba" : {
    "statistic" : {
      "failed" : 0,
      "broken" : 0,
      "skipped" : 0,
      "passed" : 1,
      "unknown" : 0,
      "total" : 1
    },
    "items" : [ {
      "uid" : "f4e99d353b14843b",
      "status" : "passed",
      "time" : {
        "start" : 1609832893331,
        "stop" : 1609832893354,
        "duration" : 23
      }
    } ]
  },
  "9e431b066c110c943eeb675894efeca5" : {
    "statistic" : {
      "failed" : 0,
      "broken" : 0,
      "skipped" : 0,
      "passed" : 1,
      "unknown" : 0,
      "total" : 1
    },
    "items" : [ {
      "uid" : "422b4c361ae260b7",
      "status" : "passed",
      "time" : {
        "start" : 1609832842063,
        "stop" : 1609832845172,
        "duration" : 3109
      }
    } ]
  },
  "3a2531e11bd4600277a02580697201b2" : {
    "statistic" : {
      "failed" : 0,
      "broken" : 0,
      "skipped" : 0,
      "passed" : 1,
      "unknown" : 0,
      "total" : 1
    },
    "items" : [ {
      "uid" : "1c3966e496e55d7f",
      "status" : "passed",
      "time" : {
        "start" : 1609832882196,
        "stop" : 1609832882219,
        "duration" : 23
      }
    } ]
  },
  "5bbfcb17f2a8a758d4f09a7236e4db78" : {
    "statistic" : {
      "failed" : 0,
      "broken" : 0,
      "skipped" : 0,
      "passed" : 1,
      "unknown" : 0,
      "total" : 1
    },
    "items" : [ {
      "uid" : "f24af4b6b2438dcb",
      "status" : "passed",
      "time" : {
        "start" : 1609832907719,
        "stop" : 1609832911158,
        "duration" : 3439
      }
    } ]
  },
  "b5f9899c5bd84e256ce16a4bcd5b7de8" : {
    "statistic" : {
      "failed" : 0,
      "broken" : 0,
      "skipped" : 0,
      "passed" : 1,
      "unknown" : 0,
      "total" : 1
    },
    "items" : [ {
      "uid" : "f73b6bf69bdd54f",
      "status" : "passed",
      "time" : {
        "start" : 1609832917223,
        "stop" : 1609832917243,
        "duration" : 20
      }
    } ]
  },
  "5330c5dfa193af33fc03e6071192a523" : {
    "statistic" : {
      "failed" : 0,
      "broken" : 0,
      "skipped" : 0,
      "passed" : 1,
      "unknown" : 0,
      "total" : 1
    },
    "items" : [ {
      "uid" : "b0026b8f09093e19",
      "status" : "passed",
      "time" : {
        "start" : 1609832848127,
        "stop" : 1609832848127,
        "duration" : 0
      }
    } ]
  },
  "d3df21d25d79b626beb9cdf746bbe4c8" : {
    "statistic" : {
      "failed" : 0,
      "broken" : 0,
      "skipped" : 0,
      "passed" : 1,
      "unknown" : 0,
      "total" : 1
    },
    "items" : [ {
      "uid" : "c698d94f576ea7b5",
      "status" : "passed",
      "time" : {
        "start" : 1609832887965,
        "stop" : 1609832889717,
        "duration" : 1752
      }
    } ]
  },
  "80bf20ba86bc6ced3bfe30d1b001f8ed" : {
    "statistic" : {
      "failed" : 0,
      "broken" : 0,
      "skipped" : 0,
      "passed" : 1,
      "unknown" : 0,
      "total" : 1
    },
    "items" : [ {
      "uid" : "8d5e54e9d1d63397",
      "status" : "passed",
      "time" : {
        "start" : 1609832853070,
        "stop" : 1609832853097,
        "duration" : 27
      }
    } ]
  },
  "ad717f8d8d910634efd2e36ac8f13b70" : {
    "statistic" : {
      "failed" : 0,
      "broken" : 0,
      "skipped" : 0,
      "passed" : 1,
      "unknown" : 0,
      "total" : 1
    },
    "items" : [ {
      "uid" : "2be8edf46e9b4159",
      "status" : "passed",
      "time" : {
        "start" : 1609832887934,
        "stop" : 1609832887959,
        "duration" : 25
      }
    } ]
  },
  "7834eb4f513bbab0d92466c6e665b74f" : {
    "statistic" : {
      "failed" : 0,
      "broken" : 0,
      "skipped" : 0,
      "passed" : 1,
      "unknown" : 0,
      "total" : 1
    },
    "items" : [ {
      "uid" : "92437df14d1f0be8",
      "status" : "passed",
      "time" : {
        "start" : 1609832899112,
        "stop" : 1609832899138,
        "duration" : 26
      }
    } ]
  },
  "1ac056208343b3c6d23c6b4410801763" : {
    "statistic" : {
      "failed" : 0,
      "broken" : 0,
      "skipped" : 0,
      "passed" : 1,
      "unknown" : 0,
      "total" : 1
    },
    "items" : [ {
      "uid" : "30639ac92e2e6aa1",
      "status" : "passed",
      "time" : {
        "start" : 1609832878322,
        "stop" : 1609832882196,
        "duration" : 3874
      }
    } ]
  },
  "d62d0956f451b10129108194d87315d0" : {
    "statistic" : {
      "failed" : 0,
      "broken" : 0,
      "skipped" : 0,
      "passed" : 1,
      "unknown" : 0,
      "total" : 1
    },
    "items" : [ {
      "uid" : "269c2e82affb658",
      "status" : "passed",
      "time" : {
        "start" : 1609832848011,
        "stop" : 1609832848127,
        "duration" : 116
      }
    } ]
  },
  "71912ed152d2e38d328a267b71c6f29a" : {
    "statistic" : {
      "failed" : 0,
      "broken" : 0,
      "skipped" : 0,
      "passed" : 1,
      "unknown" : 0,
      "total" : 1
    },
    "items" : [ {
      "uid" : "47313da1ec11b3ed",
      "status" : "passed",
      "time" : {
        "start" : 1609832887959,
        "stop" : 1609832887959,
        "duration" : 0
      }
    } ]
  }
}