[
  {
    "element-6066-11e4-a52e-4f735466cecf": "f6b9ff7f-709e-48af-b8fa-c7627bb6fd80"
  },
  {
    "element-6066-11e4-a52e-4f735466cecf": "b728ae42-3cc3-4535-9443-baa6377d34c2"
  },
  {
    "element-6066-11e4-a52e-4f735466cecf": "429adf09-5c41-45a1-abdd-aabcadc18216"
  },
  {
    "element-6066-11e4-a52e-4f735466cecf": "daf6f132-0e81-4b15-9c42-5deac11b8dcd"
  },
  {
    "element-6066-11e4-a52e-4f735466cecf": "2f878d06-2226-4f44-9f25-cbd9f6407b14"
  },
  {
    "element-6066-11e4-a52e-4f735466cecf": "62a74a7e-795f-46c6-a980-ea45187a05c9"
  },
  {
    "element-6066-11e4-a52e-4f735466cecf": "1cf4f256-fb1e-438d-bd7a-e3af905c184d"
  },
  {
    "element-6066-11e4-a52e-4f735466cecf": "ecb8c2ac-8916-4ebf-a1ed-45bf8ed1f711"
  },
  {
    "element-6066-11e4-a52e-4f735466cecf": "7dcc7f41-0aab-4c07-88d8-b4df8c262b44"
  },
  {
    "element-6066-11e4-a52e-4f735466cecf": "519d4101-b77d-4275-9668-feda923ac916"
  },
  {
    "element-6066-11e4-a52e-4f735466cecf": "20e3f66e-a621-4a26-b9c8-2be017a85bc3"
  },
  {
    "element-6066-11e4-a52e-4f735466cecf": "1e66d9af-ec1f-4af7-b5a6-06f96f9a27f6"
  }
]