[
  {
    "element-6066-11e4-a52e-4f735466cecf": "5a613ddf-6011-49db-854f-fd0625f76165"
  },
  {
    "element-6066-11e4-a52e-4f735466cecf": "dca436e4-a083-43a8-b96a-c7106aa6dfbc"
  },
  {
    "element-6066-11e4-a52e-4f735466cecf": "d0652bfa-d94f-433d-b434-6d718638b479"
  },
  {
    "element-6066-11e4-a52e-4f735466cecf": "78d4656c-b087-4d45-b656-0ed22c4bd797"
  },
  {
    "element-6066-11e4-a52e-4f735466cecf": "c4623272-5e74-4212-a1c0-9308dfd69004"
  },
  {
    "element-6066-11e4-a52e-4f735466cecf": "bbc01694-05e8-40b9-8329-417781ca1f43"
  },
  {
    "element-6066-11e4-a52e-4f735466cecf": "a0f92546-0286-44ba-9ef1-d94ebd36cc60"
  },
  {
    "element-6066-11e4-a52e-4f735466cecf": "28a40036-af33-4bb8-aade-3b16a54add1a"
  },
  {
    "element-6066-11e4-a52e-4f735466cecf": "5ce56375-d8ea-4f76-b0ed-975cbf439095"
  },
  {
    "element-6066-11e4-a52e-4f735466cecf": "d8891ecd-fc40-4040-b719-e1b25b57f416"
  },
  {
    "element-6066-11e4-a52e-4f735466cecf": "f2b6bb65-6549-4cbf-bd1a-0a0290caddf7"
  },
  {
    "element-6066-11e4-a52e-4f735466cecf": "790403b1-30e8-425a-8d6e-68cc41cb9a5b"
  }
]