"Status","Start Time","Stop Time","Duration in ms","Parent Suite","Suite","Sub Suite","Test Class","Test Method","Name","Description"
"passed","Wed Dec 30 23:22:27 CET 2020","Wed Dec 30 23:22:27 CET 2020","25","","Cars filtering: Filter by selecting AVG value of Term(36 months) and Mileage filter","","Cars filtering: Filter by selecting AVG value of Term(36 months) and Mileage filter","Then results of related cars with AVG value of Term - 36 months are displayed","Then results of related cars with AVG value of Term - 36 months are displayed",""
"passed","Wed Dec 30 23:21:38 CET 2020","Wed Dec 30 23:21:38 CET 2020","0","","Cars filtering: Filter by selecting 'Best Deals' checkbox from Popular filters","","Cars filtering: Filter by selecting 'Best Deals' checkbox from Popular filters","Hook","Hook",""
"passed","Wed Dec 30 23:22:45 CET 2020","Wed Dec 30 23:22:45 CET 2020","1","","Cars filtering: Filter by selecting any type from 'Fuel type' filter","","Cars filtering: Filter by selecting any type from 'Fuel type' filter","Hook","Hook",""
"passed","Wed Dec 30 23:22:23 CET 2020","Wed Dec 30 23:22:27 CET 2020","3544","","Cars filtering: Filter by selecting AVG value of Term(36 months) and Mileage filter","","Cars filtering: Filter by selecting AVG value of Term(36 months) and Mileage filter","When the user search AVG value of Term - 36 months and Mileage","When the user search AVG value of Term - 36 months and Mileage",""
"passed","Wed Dec 30 23:22:32 CET 2020","Wed Dec 30 23:22:32 CET 2020","0","","Cars filtering: Filter by selecting AVG value of Term(48 months) and Mileage filter","","Cars filtering: Filter by selecting AVG value of Term(48 months) and Mileage filter","Hook","Hook",""
"passed","Wed Dec 30 23:22:58 CET 2020","Wed Dec 30 23:22:58 CET 2020","1","","Cars filtering: Filter by selecting any value from unavailable checkbox","","Cars filtering: Filter by selecting any value from unavailable checkbox","Hook","Hook",""
"passed","Wed Dec 30 23:21:45 CET 2020","Wed Dec 30 23:21:47 CET 2020","1781","","Cars filtering: Filter by selecting 'Configure yourself' checkbox from Popular filters","","Cars filtering: Filter by selecting 'Configure yourself' checkbox from Popular filters","Given the browser is at Our Vehicles page","Given the browser is at Our Vehicles page",""
"passed","Wed Dec 30 23:22:08 CET 2020","Wed Dec 30 23:22:13 CET 2020","4547","","Cars filtering: Filter by selecting a MIN price from MonthlyPrice filters","","Cars filtering: Filter by selecting a MIN price from MonthlyPrice filters","Given the browser is at Our Vehicles page","Given the browser is at Our Vehicles page",""
"passed","Wed Dec 30 23:22:03 CET 2020","Wed Dec 30 23:22:03 CET 2020","0","","Cars filtering: Filter by selecting any car from 'Other Makes' checkbox of Make&Model filter","","Cars filtering: Filter by selecting any car from 'Other Makes' checkbox of Make&Model filter","Hook","Hook",""
"passed","Wed Dec 30 23:22:22 CET 2020","Wed Dec 30 23:22:22 CET 2020","0","","Cars filtering: Filter by selecting MIN value of Term(24 months) and Mileage filter","","Cars filtering: Filter by selecting MIN value of Term(24 months) and Mileage filter","Hook","Hook",""
"passed","Wed Dec 30 23:22:08 CET 2020","Wed Dec 30 23:22:08 CET 2020","34","","Cars filtering: Filter by selecting a MAX price from MonthlyPrice filters","","Cars filtering: Filter by selecting a MAX price from MonthlyPrice filters","Then results of related cars with MAX price are displayed","Then results of related cars with MAX price are displayed",""
"passed","Wed Dec 30 23:22:22 CET 2020","Wed Dec 30 23:22:23 CET 2020","1821","","Cars filtering: Filter by selecting AVG value of Term(36 months) and Mileage filter","","Cars filtering: Filter by selecting AVG value of Term(36 months) and Mileage filter","Given the browser is at Our Vehicles page","Given the browser is at Our Vehicles page",""
"passed","Wed Dec 30 23:22:49 CET 2020","Wed Dec 30 23:22:52 CET 2020","3529","","Cars filtering: Filter by selecting any value from unavailable checkbox","","Cars filtering: Filter by selecting any value from unavailable checkbox","When the user search for 'Audi' by using 'Best deals' filter","When the user search for 'Audi' by using 'Best deals' filter",""
"passed","Wed Dec 30 23:22:08 CET 2020","Wed Dec 30 23:22:08 CET 2020","0","","Cars filtering: Filter by selecting a MAX price from MonthlyPrice filters","","Cars filtering: Filter by selecting a MAX price from MonthlyPrice filters","Hook","Hook",""
"passed","Wed Dec 30 23:21:59 CET 2020","Wed Dec 30 23:22:03 CET 2020","4814","","Cars filtering: Filter by selecting any car from 'Other Makes' checkbox of Make&Model filter","","Cars filtering: Filter by selecting any car from 'Other Makes' checkbox of Make&Model filter","When the user search for 'EVOQUE Land Rover'","When the user search for 'EVOQUE Land Rover'",""
"passed","Wed Dec 30 23:22:52 CET 2020","Wed Dec 30 23:22:54 CET 2020","1805","","Cars filtering: Filter by selecting any value from unavailable checkbox","","Cars filtering: Filter by selecting any value from unavailable checkbox","Given the browser is at Our Vehicles page","Given the browser is at Our Vehicles page",""
"passed","Wed Dec 30 23:21:50 CET 2020","Wed Dec 30 23:21:50 CET 2020","0","","Cars filtering: Filter by selecting 'Configure yourself' checkbox from Popular filters","","Cars filtering: Filter by selecting 'Configure yourself' checkbox from Popular filters","Hook","Hook",""
"passed","Wed Dec 30 23:21:57 CET 2020","Wed Dec 30 23:21:57 CET 2020","24","","Cars filtering: Filter by selecting any car from 'Popular Makes' checkbox of Make&Model filter","","Cars filtering: Filter by selecting any car from 'Popular Makes' checkbox of Make&Model filter","Then results of related cars with 'Mersedes A' mark are displayed","Then results of related cars with 'Mersedes A' mark are displayed",""
"passed","Wed Dec 30 23:22:29 CET 2020","Wed Dec 30 23:22:32 CET 2020","3516","","Cars filtering: Filter by selecting AVG value of Term(48 months) and Mileage filter","","Cars filtering: Filter by selecting AVG value of Term(48 months) and Mileage filter","When the user search AVG value of Term - 48 months and Mileage","When the user search AVG value of Term - 48 months and Mileage",""
"passed","Wed Dec 30 23:22:41 CET 2020","Wed Dec 30 23:22:44 CET 2020","3194","","Cars filtering: Filter by selecting any type from 'Fuel type' filter","","Cars filtering: Filter by selecting any type from 'Fuel type' filter","When the user search for 'Electric'","When the user search for 'Electric'",""
"passed","Wed Dec 30 23:22:27 CET 2020","Wed Dec 30 23:22:27 CET 2020","0","","Cars filtering: Filter by selecting AVG value of Term(36 months) and Mileage filter","","Cars filtering: Filter by selecting AVG value of Term(36 months) and Mileage filter","Hook","Hook",""
"passed","Wed Dec 30 23:22:03 CET 2020","Wed Dec 30 23:22:03 CET 2020","30","","Cars filtering: Filter by selecting any car from 'Other Makes' checkbox of Make&Model filter","","Cars filtering: Filter by selecting any car from 'Other Makes' checkbox of Make&Model filter","Then results of related cars with a 'EVOQUE Land Rover' mark are displayed","Then results of related cars with a 'EVOQUE Land Rover' mark are displayed",""
"passed","Wed Dec 30 23:22:38 CET 2020","Wed Dec 30 23:22:38 CET 2020","1","","Cars filtering: Filter by selecting MAX value of Term(60 months) and Mileage filter","","Cars filtering: Filter by selecting MAX value of Term(60 months) and Mileage filter","Hook","Hook",""
"passed","Wed Dec 30 23:22:54 CET 2020","Wed Dec 30 23:22:58 CET 2020","4254","","Cars filtering: Filter by selecting any value from unavailable checkbox","","Cars filtering: Filter by selecting any value from unavailable checkbox","When the user search for 'Tesla' model by using 'Configure Yourself' filter","When the user search for 'Tesla' model by using 'Configure Yourself' filter",""
"passed","Wed Dec 30 23:21:42 CET 2020","Wed Dec 30 23:21:45 CET 2020","3093","","Cars filtering: Filter by selecting 'No stress plan' checkbox from Popular filters","","Cars filtering: Filter by selecting 'No stress plan' checkbox from Popular filters","When the user search for 'No stress plan'","When the user search for 'No stress plan'",""
"passed","Wed Dec 30 23:22:03 CET 2020","Wed Dec 30 23:22:05 CET 2020","1783","","Cars filtering: Filter by selecting a MAX price from MonthlyPrice filters","","Cars filtering: Filter by selecting a MAX price from MonthlyPrice filters","Given the browser is at Our Vehicles page","Given the browser is at Our Vehicles page",""
"passed","Wed Dec 30 23:22:38 CET 2020","Wed Dec 30 23:22:38 CET 2020","25","","Cars filtering: Filter by selecting MAX value of Term(60 months) and Mileage filter","","Cars filtering: Filter by selecting MAX value of Term(60 months) and Mileage filter","Then results of related cars with MAX value of Term - 60 months are displayed","Then results of related cars with MAX value of Term - 60 months are displayed",""
"passed","Wed Dec 30 23:21:57 CET 2020","Wed Dec 30 23:21:59 CET 2020","1832","","Cars filtering: Filter by selecting any car from 'Other Makes' checkbox of Make&Model filter","","Cars filtering: Filter by selecting any car from 'Other Makes' checkbox of Make&Model filter","Given the browser is at Our Vehicles page","Given the browser is at Our Vehicles page",""
"passed","Wed Dec 30 23:22:22 CET 2020","Wed Dec 30 23:22:22 CET 2020","23","","Cars filtering: Filter by selecting MIN value of Term(24 months) and Mileage filter","","Cars filtering: Filter by selecting MIN value of Term(24 months) and Mileage filter","Then results of related cars with MIN value of Term - 24 months are displayed","Then results of related cars with MIN value of Term - 24 months are displayed",""
"passed","Wed Dec 30 23:22:05 CET 2020","Wed Dec 30 23:22:08 CET 2020","3235","","Cars filtering: Filter by selecting a MAX price from MonthlyPrice filters","","Cars filtering: Filter by selecting a MAX price from MonthlyPrice filters","When the user search a MAX price of cars","When the user search a MAX price of cars",""
"passed","Wed Dec 30 23:22:38 CET 2020","Wed Dec 30 23:22:41 CET 2020","3217","","Cars filtering: Filter by selecting any type from 'Fuel type' filter","","Cars filtering: Filter by selecting any type from 'Fuel type' filter","Given the browser is at Our Vehicles page","Given the browser is at Our Vehicles page",""
"passed","Wed Dec 30 23:21:52 CET 2020","Wed Dec 30 23:21:57 CET 2020","4919","","Cars filtering: Filter by selecting any car from 'Popular Makes' checkbox of Make&Model filter","","Cars filtering: Filter by selecting any car from 'Popular Makes' checkbox of Make&Model filter","When the user search for 'Mersedes A'","When the user search for 'Mersedes A'",""
"passed","Wed Dec 30 23:22:44 CET 2020","Wed Dec 30 23:22:45 CET 2020","122","","Cars filtering: Filter by selecting any type from 'Fuel type' filter","","Cars filtering: Filter by selecting any type from 'Fuel type' filter","Then results of related cars with 'Electric' fuel type are displayed","Then results of related cars with 'Electric' fuel type are displayed",""
"passed","Wed Dec 30 23:22:27 CET 2020","Wed Dec 30 23:22:29 CET 2020","1795","","Cars filtering: Filter by selecting AVG value of Term(48 months) and Mileage filter","","Cars filtering: Filter by selecting AVG value of Term(48 months) and Mileage filter","Given the browser is at Our Vehicles page","Given the browser is at Our Vehicles page",""
"passed","Wed Dec 30 23:21:27 CET 2020","Wed Dec 30 23:21:32 CET 2020","4255","","Cars filtering: Filter by selecting 'Best Deals' checkbox from Popular filters","","Cars filtering: Filter by selecting 'Best Deals' checkbox from Popular filters","Given the browser is at Our Vehicles page","Given the browser is at Our Vehicles page",""
"passed","Wed Dec 30 23:21:45 CET 2020","Wed Dec 30 23:21:45 CET 2020","114","","Cars filtering: Filter by selecting 'No stress plan' checkbox from Popular filters","","Cars filtering: Filter by selecting 'No stress plan' checkbox from Popular filters","Then results of related cars with a 'No stress plan' are displayed","Then results of related cars with a 'No stress plan' are displayed",""
"passed","Wed Dec 30 23:22:16 CET 2020","Wed Dec 30 23:22:18 CET 2020","1707","","Cars filtering: Filter by selecting MIN value of Term(24 months) and Mileage filter","","Cars filtering: Filter by selecting MIN value of Term(24 months) and Mileage filter","Given the browser is at Our Vehicles page","Given the browser is at Our Vehicles page",""
"passed","Wed Dec 30 23:22:35 CET 2020","Wed Dec 30 23:22:38 CET 2020","2537","","Cars filtering: Filter by selecting MAX value of Term(60 months) and Mileage filter","","Cars filtering: Filter by selecting MAX value of Term(60 months) and Mileage filter","When the user search MAX value of Term - 60 months and Mileage","When the user search MAX value of Term - 60 months and Mileage",""
"passed","Wed Dec 30 23:21:45 CET 2020","Wed Dec 30 23:21:45 CET 2020","1","","Cars filtering: Filter by selecting 'No stress plan' checkbox from Popular filters","","Cars filtering: Filter by selecting 'No stress plan' checkbox from Popular filters","Hook","Hook",""
"passed","Wed Dec 30 23:22:32 CET 2020","Wed Dec 30 23:22:35 CET 2020","3143","","Cars filtering: Filter by selecting MAX value of Term(60 months) and Mileage filter","","Cars filtering: Filter by selecting MAX value of Term(60 months) and Mileage filter","Given the browser is at Our Vehicles page","Given the browser is at Our Vehicles page",""
"passed","Wed Dec 30 23:22:16 CET 2020","Wed Dec 30 23:22:16 CET 2020","53","","Cars filtering: Filter by selecting a MIN price from MonthlyPrice filters","","Cars filtering: Filter by selecting a MIN price from MonthlyPrice filters","Then results of related cars with MIN price are displayed","Then results of related cars with MIN price are displayed",""
"passed","Wed Dec 30 23:22:52 CET 2020","Wed Dec 30 23:22:52 CET 2020","19","","Cars filtering: Filter by selecting any value from unavailable checkbox","","Cars filtering: Filter by selecting any value from unavailable checkbox","Then no results of related cars with 'Audi' model are displayed","Then no results of related cars with 'Audi' model are displayed",""
"passed","Wed Dec 30 23:21:50 CET 2020","Wed Dec 30 23:21:52 CET 2020","1769","","Cars filtering: Filter by selecting any car from 'Popular Makes' checkbox of Make&Model filter","","Cars filtering: Filter by selecting any car from 'Popular Makes' checkbox of Make&Model filter","Given the browser is at Our Vehicles page","Given the browser is at Our Vehicles page",""
"passed","Wed Dec 30 23:22:18 CET 2020","Wed Dec 30 23:22:22 CET 2020","3528","","Cars filtering: Filter by selecting MIN value of Term(24 months) and Mileage filter","","Cars filtering: Filter by selecting MIN value of Term(24 months) and Mileage filter","When the user search MIN value of Term and Mileage","When the user search MIN value of Term and Mileage",""
"passed","Wed Dec 30 23:22:13 CET 2020","Wed Dec 30 23:22:16 CET 2020","3304","","Cars filtering: Filter by selecting a MIN price from MonthlyPrice filters","","Cars filtering: Filter by selecting a MIN price from MonthlyPrice filters","When the user search a MIN price of cars","When the user search a MIN price of cars",""
"passed","Wed Dec 30 23:21:32 CET 2020","Wed Dec 30 23:21:38 CET 2020","6510","","Cars filtering: Filter by selecting 'Best Deals' checkbox from Popular filters","","Cars filtering: Filter by selecting 'Best Deals' checkbox from Popular filters","When the user search for 'Best Deals'","When the user search for 'Best Deals'",""
"passed","Wed Dec 30 23:21:38 CET 2020","Wed Dec 30 23:21:38 CET 2020","186","","Cars filtering: Filter by selecting 'Best Deals' checkbox from Popular filters","","Cars filtering: Filter by selecting 'Best Deals' checkbox from Popular filters","Then results of related cars with 'Best Deals' mark are displayed","Then results of related cars with 'Best Deals' mark are displayed",""
"passed","Wed Dec 30 23:22:32 CET 2020","Wed Dec 30 23:22:32 CET 2020","23","","Cars filtering: Filter by selecting AVG value of Term(48 months) and Mileage filter","","Cars filtering: Filter by selecting AVG value of Term(48 months) and Mileage filter","Then results of related cars with AVG value of Term - 48 months are displayed","Then results of related cars with AVG value of Term - 48 months are displayed",""
"passed","Wed Dec 30 23:22:58 CET 2020","Wed Dec 30 23:22:58 CET 2020","19","","Cars filtering: Filter by selecting any value from unavailable checkbox","","Cars filtering: Filter by selecting any value from unavailable checkbox","Then no results of related cars with 'Hybrid' fuel type are displayed","Then no results of related cars with 'Hybrid' fuel type are displayed",""
"passed","Wed Dec 30 23:22:16 CET 2020","Wed Dec 30 23:22:16 CET 2020","0","","Cars filtering: Filter by selecting a MIN price from MonthlyPrice filters","","Cars filtering: Filter by selecting a MIN price from MonthlyPrice filters","Hook","Hook",""
"passed","Wed Dec 30 23:21:38 CET 2020","Wed Dec 30 23:21:42 CET 2020","3429","","Cars filtering: Filter by selecting 'No stress plan' checkbox from Popular filters","","Cars filtering: Filter by selecting 'No stress plan' checkbox from Popular filters","Given the browser is at Our Vehicles page","Given the browser is at Our Vehicles page",""
"passed","Wed Dec 30 23:21:47 CET 2020","Wed Dec 30 23:21:50 CET 2020","3094","","Cars filtering: Filter by selecting 'Configure yourself' checkbox from Popular filters","","Cars filtering: Filter by selecting 'Configure yourself' checkbox from Popular filters","When the user search for 'Configure yourself'","When the user search for 'Configure yourself'",""
"passed","Wed Dec 30 23:21:57 CET 2020","Wed Dec 30 23:21:57 CET 2020","0","","Cars filtering: Filter by selecting any car from 'Popular Makes' checkbox of Make&Model filter","","Cars filtering: Filter by selecting any car from 'Popular Makes' checkbox of Make&Model filter","Hook","Hook",""
"passed","Wed Dec 30 23:21:50 CET 2020","Wed Dec 30 23:21:50 CET 2020","28","","Cars filtering: Filter by selecting 'Configure yourself' checkbox from Popular filters","","Cars filtering: Filter by selecting 'Configure yourself' checkbox from Popular filters","Then results of related cars sums are displayed","Then results of related cars sums are displayed",""
