[
  {
    "element-6066-11e4-a52e-4f735466cecf": "bfa455c3-e193-4d6d-ac34-6b4d9a647ce5"
  },
  {
    "element-6066-11e4-a52e-4f735466cecf": "a0131f7f-d0aa-47b5-b343-7ee3a3a0833e"
  },
  {
    "element-6066-11e4-a52e-4f735466cecf": "69247a6c-c85c-4f3a-ba24-c85050035c23"
  },
  {
    "element-6066-11e4-a52e-4f735466cecf": "52891fc5-d86a-49f5-bbb3-6048f8e419b1"
  },
  {
    "element-6066-11e4-a52e-4f735466cecf": "e57e955c-0849-46b7-af66-092ef27d999d"
  },
  {
    "element-6066-11e4-a52e-4f735466cecf": "db6a13f4-9f1b-4f33-a6bc-edf571ff008a"
  },
  {
    "element-6066-11e4-a52e-4f735466cecf": "c549ce80-34ef-4afe-8bd1-30b06e3f3264"
  }
]