[
  {
    "element-6066-11e4-a52e-4f735466cecf": "33ec6cc8-89c8-40df-b022-d3c35dd4f6a9"
  },
  {
    "element-6066-11e4-a52e-4f735466cecf": "99250d3c-ac70-4bfe-a0a6-2bf7c34455fe"
  },
  {
    "element-6066-11e4-a52e-4f735466cecf": "76252de0-4e53-42cc-a368-21d2b0c00406"
  },
  {
    "element-6066-11e4-a52e-4f735466cecf": "57f51051-f74b-466e-914d-8a969abb329e"
  },
  {
    "element-6066-11e4-a52e-4f735466cecf": "ef86a127-eeea-48ea-b95d-90da1af6d9ba"
  },
  {
    "element-6066-11e4-a52e-4f735466cecf": "79ba8b05-55e9-4302-8406-9b36ec51e3d5"
  },
  {
    "element-6066-11e4-a52e-4f735466cecf": "777e1c3f-bb8f-4062-b65d-7ac2c8725d9a"
  }
]