launch_status failed=0 1609367010000000000
launch_status broken=0 1609367010000000000
launch_status passed=54 1609367010000000000
launch_status skipped=0 1609367010000000000
launch_status unknown=0 1609367010000000000
launch_time duration=91036 1609367010000000000
launch_time min_duration=0 1609367010000000000
launch_time max_duration=6510 1609367010000000000
launch_time sum_duration=86684 1609367010000000000
launch_retries retries=436 1609367010000000000
launch_retries run=54 1609367010000000000
