[
  {
    "element-6066-11e4-a52e-4f735466cecf": "2a4fdebb-91f6-4952-b43f-0f0bdddadca5"
  },
  {
    "element-6066-11e4-a52e-4f735466cecf": "46443730-4c5f-4e96-afbd-615a35fa7f56"
  },
  {
    "element-6066-11e4-a52e-4f735466cecf": "f9dd2139-a57c-4e95-8df4-d36c1debeb1b"
  },
  {
    "element-6066-11e4-a52e-4f735466cecf": "97987619-cc7e-4b8c-a2c7-354eb940e2f6"
  },
  {
    "element-6066-11e4-a52e-4f735466cecf": "163d0ff0-d6c8-4d88-ba01-6a61d12b1445"
  },
  {
    "element-6066-11e4-a52e-4f735466cecf": "32e5b271-5475-4e99-a680-eb3ff9faa887"
  },
  {
    "element-6066-11e4-a52e-4f735466cecf": "e80f74c4-d739-472f-ab8b-ae49dec0a6ee"
  },
  {
    "element-6066-11e4-a52e-4f735466cecf": "89431be8-80b7-45c2-a3cf-5bc614f7aabc"
  },
  {
    "element-6066-11e4-a52e-4f735466cecf": "8539a59c-ab1f-49c2-a593-b8e162a413a2"
  },
  {
    "element-6066-11e4-a52e-4f735466cecf": "6d55e791-a887-4d71-a0e5-116cb0ca1e84"
  },
  {
    "element-6066-11e4-a52e-4f735466cecf": "e3cb1158-b0f7-4d22-bcff-1f4bc2290d31"
  }
]