[
  {
    "element-6066-11e4-a52e-4f735466cecf": "5ab31942-0154-49f2-9aaf-f34176f8a1d2"
  },
  {
    "element-6066-11e4-a52e-4f735466cecf": "03cd4b2a-6245-475c-9893-9b0a8477fba9"
  },
  {
    "element-6066-11e4-a52e-4f735466cecf": "ba92082d-d3ed-4fb7-9189-a5adc4160162"
  },
  {
    "element-6066-11e4-a52e-4f735466cecf": "375c4404-ba01-408a-8810-7cfe622e0529"
  },
  {
    "element-6066-11e4-a52e-4f735466cecf": "3c7d1db4-c552-4d62-bafe-d576f857211c"
  },
  {
    "element-6066-11e4-a52e-4f735466cecf": "c33ec367-580f-48ad-b549-0725f2fb3101"
  },
  {
    "element-6066-11e4-a52e-4f735466cecf": "cfccf9cf-79aa-4bd5-85b8-caeff6733aaa"
  }
]