{
  "script": "return (function isElementDisplayed(element) {\n    function nodeIsElement(node) {\n        if (!node) {\n            return false;\n        }\n        switch (node.nodeType) {\n            case Node.ELEMENT_NODE:\n            case Node.DOCUMENT_NODE:\n            case Node.DOCUMENT_FRAGMENT_NODE:\n                return true;\n            default:\n                return false;\n        }\n    }\n    function parentElementForElement(element) {\n        if (!element) {\n            return null;\n        }\n        return enclosingNodeOrSelfMatchingPredicate(element.parentNode, nodeIsElement);\n    }\n    function enclosingNodeOrSelfMatchingPredicate(targetNode, predicate) {\n        for (let node = targetNode; node && node !== targetNode.ownerDocument; node = node.parentNode)\n            if (predicate(node)) {\n                return node;\n            }\n        return null;\n    }\n    function enclosingElementOrSelfMatchingPredicate(targetElement, predicate) {\n        for (let element = targetElement; element && element !== targetElement.ownerDocument; element = parentElementForElement(element))\n            if (predicate(element)) {\n                return element;\n            }\n        return null;\n    }\n    function cascadedStylePropertyForElement(element, property) {\n        if (!element || !property) {\n            return null;\n        }\n        if (element instanceof DocumentFragment) {\n            element = element.host;\n        }\n        let computedStyle = window.getComputedStyle(element);\n        let computedStyleProperty = computedStyle.getPropertyValue(property);\n        if (computedStyleProperty && computedStyleProperty !== 'inherit') {\n            return computedStyleProperty;\n        }\n        let parentElement = parentElementForElement(element);\n        return cascadedStylePropertyForElement(parentElement, property);\n    }\n    function elementSubtreeHasNonZeroDimensions(element) {\n        let boundingBox = element.getBoundingClientRect();\n        if (boundingBox.width > 0 && boundingBox.height > 0) {\n            return true;\n        }\n        if (element.tagName.toUpperCase() === 'PATH' && boundingBox.width + boundingBox.height > 0) {\n            let strokeWidth = cascadedStylePropertyForElement(element, 'stroke-width');\n            return !!strokeWidth && (parseInt(strokeWidth, 10) > 0);\n        }\n        let cascadedOverflow = cascadedStylePropertyForElement(element, 'overflow');\n        if (cascadedOverflow === 'hidden') {\n            return false;\n        }\n        return Array.from(element.childNodes).some((childNode) => {\n            if (childNode.nodeType === Node.TEXT_NODE) {\n                return true;\n            }\n            if (nodeIsElement(childNode)) {\n                return elementSubtreeHasNonZeroDimensions(childNode);\n            }\n            return false;\n        });\n    }\n    function elementOverflowsContainer(element) {\n        let cascadedOverflow = cascadedStylePropertyForElement(element, 'overflow');\n        if (cascadedOverflow !== 'hidden') {\n            return false;\n        }\n        return true;\n    }\n    function isElementSubtreeHiddenByOverflow(element) {\n        if (!element) {\n            return false;\n        }\n        if (!elementOverflowsContainer(element)) {\n            return false;\n        }\n        if (!element.childNodes.length) {\n            return false;\n        }\n        return Array.from(element.childNodes).every((childNode) => {\n            if (childNode.nodeType === Node.TEXT_NODE) {\n                return false;\n            }\n            if (!nodeIsElement(childNode)) {\n                return true;\n            }\n            if (!elementSubtreeHasNonZeroDimensions(childNode)) {\n                return true;\n            }\n            return isElementSubtreeHiddenByOverflow(childNode);\n        });\n    }\n    function isElementInsideShadowRoot(element) {\n        if (!element) {\n            return false;\n        }\n        if (element.parentNode && element.parentNode.host) {\n            return true;\n        }\n        return isElementInsideShadowRoot(element.parentNode);\n    }\n    if (!isElementInsideShadowRoot(element) && !document.contains(element)) {\n        return false;\n    }\n    switch (element.tagName.toUpperCase()) {\n        case 'BODY':\n            return true;\n        case 'SCRIPT':\n        case 'NOSCRIPT':\n            return false;\n        case 'OPTGROUP':\n        case 'OPTION': {\n            let enclosingSelectElement = enclosingNodeOrSelfMatchingPredicate(element, (e) => e.tagName.toUpperCase() === 'SELECT');\n            return isElementDisplayed(enclosingSelectElement);\n        }\n        case 'INPUT':\n            if (element.type === 'hidden') {\n                return false;\n            }\n            break;\n        default:\n            break;\n    }\n    if (cascadedStylePropertyForElement(element, 'visibility') !== 'visible') {\n        return false;\n    }\n    let hasAncestorWithZeroOpacity = !!enclosingElementOrSelfMatchingPredicate(element, (e) => {\n        return Number(cascadedStylePropertyForElement(e, 'opacity')) === 0;\n    });\n    let hasAncestorWithDisplayNone = !!enclosingElementOrSelfMatchingPredicate(element, (e) => {\n        return cascadedStylePropertyForElement(e, 'display') === 'none';\n    });\n    if (hasAncestorWithZeroOpacity || hasAncestorWithDisplayNone) {\n        return false;\n    }\n    if (!elementSubtreeHasNonZeroDimensions(element)) {\n        return false;\n    }\n    if (isElementSubtreeHiddenByOverflow(element)) {\n        return false;\n    }\n    return true;\n}).apply(null, arguments)",
  "args": [
    {
      "element-6066-11e4-a52e-4f735466cecf": "b1fa592e-781f-4fc1-9c62-c9f06bd5d825",
      "ELEMENT": "b1fa592e-781f-4fc1-9c62-c9f06bd5d825"
    }
  ]
}