{
  "project_info": {
    "project_number": "770468302615",
    "project_id": "my-notes-app2",
    "storage_bucket": "my-notes-app2.appspot.com"
  },
  "client": [
    {
      "client_info": {
        "mobilesdk_app_id": "1:770468302615:android:8ea42c92767ba438b6b152",
        "android_client_info": {
          "package_name": "tech.groundgurus.mynotes"
        }
      },
      "oauth_client": [
        {
          "client_id": "770468302615-fjktfiplgoip8uooc8hpji0f27j2a7k6.apps.googleusercontent.com",
          "client_type": 3
        }
      ],
      "api_key": [
        {
          "current_key": "AIzaSyCGiFEHfCwtBcM08RFSLfvl7-gvezi5AWI"
        }
      ],
      "services": {
        "appinvite_service": {
          "other_platform_oauth_client": [
            {
              "client_id": "770468302615-fjktfiplgoip8uooc8hpji0f27j2a7k6.apps.googleusercontent.com",
              "client_type": 3
            },
            {
              "client_id": "770468302615-4iile52uas1eon4o0oeqr7bsgcq0q6rr.apps.googleusercontent.com",
              "client_type": 2,
              "ios_info": {
                "bundle_id": "tech.groundgurus.mynotes"
              }
            }
          ]
        }
      }
    }
  ],
  "configuration_version": "1"
}