{
  "file_generated_by": "FlutterFire CLI",
  "purpose": "FirebaseAppID & ProjectID for this Firebase app in this directory",
  "GOOGLE_APP_ID": "1:770468302615:ios:10bcca4366b1c179b6b152",
  "FIREBASE_PROJECT_ID": "my-notes-app2",
  "GCM_SENDER_ID": "770468302615"
}