[
    {
        "id" : "de.grogra.rsmlreader",
        "name" : "rsmlReader",
        "description" : "RSMLReader plugin. In enables to read rsml files.",
        "helpUrl": "https://gitlab.com/grogra/groimp/",
        "vendor": "de.grogra",
        "mainClass": "",
        "versions" : {
            "1.0" : {
                "downloadUrl" : "https://gitlab.com/grogra/groimp-plugins/rsmlreader/-/package_files/119218669/download",
                "libs" : {
                },
                "depends" : {
                    "de.grogra.pf":"2.1.2",
                    "de.grogra.xl.compiler":"2.1.2",
                    "de.grogra.pf.ui.swing":"2.1.2",
                    "de.grogra.rgg":"2.1.2"
                }
            }
	}
    }
]

