[
    {
        "id" : "de.grogra.util.concurrent",
        "name" : "Concurrent",
        "description" : "hopefully a parallel producer",
        "helpUrl": "https://gitlab.com/grogra/groimp/",
        "vendor": "de.grogra",
        "mainClass": "",
        "versions" : {
            "0.1" : {
                "downloadUrl" : "https://gitlab.com/grogra/groimp-plugins/concurrent/-/package_files/126208777/download",
                "libs" : {
                },
                "depends" : {
                    "de.grogra.rgg":"2.1.3",
                    "de.grogra.ray":"2.1.3"
                }
            }
        }
    }
]

