[
    {
        "id" : "de.grogra.video",
        "name" : "Video",
        "description" : "The Video plugin enables to export a video or gif of a scene during a project execution. The export is based on the sofware ffmpeg.",
        "helpUrl": "https://gitlab.com/grogra/groimp-plugins/Video/",
        "vendor": "de.grogra",
        "mainClass": "",
        "versions" : {
            "2.1" : {
                "downloadUrl" : "https://gitlab.com/grogra/groimp-plugins/Video/-/package_files/94771027/download",
                "libs" : {
                },
                "depends" : {
                    "de.grogra.imp3d":"2.1.2",
                    "de.grogra.rgg":"2.1.2",
                    "de.grogra.imp":"2.1.2",
                    "de.grogra.pf":"2.1.2",
                    "de.grogra.pf.ui.swing":"2.1.2"
                }

            },
            "2.1.3" : {
                "downloadUrl" : "https://gitlab.com/grogra/groimp-plugins/Video/-/package_files/122189278/download",
                "libs" : {
                },
                "depends" : {
                    "de.grogra.imp3d":"2.1.2",
                    "de.grogra.rgg":"2.1.2",
                    "de.grogra.imp":"2.1.2",
                    "de.grogra.pf":"2.1.3",
                    "de.grogra.pf.ui.swing":"2.1.2"
                }

            },
            "2.1.4" : {
                "downloadUrl" : "https://gitlab.com/grogra/groimp-plugins/Video/-/package_files/146209520/download",
                "libs" : {
                },
                "depends" : {
                    "de.grogra.imp3d":"2.1.3",
                    "de.grogra.rgg":"2.1.3",
                    "de.grogra.imp":"2.1.3",
                    "de.grogra.pf":"2.1.3",
                    "de.grogra.pf.ui.swing":"2.1.3"
                }

            }
        }
    }
]

