[
    {
        "id" : "de.grogra.texgen",
        "name" : "TexGen",
        "description" : "TexGen contains several texture generators, i. e., algorithms for the creation of synthetic images.",
        "helpUrl": "https://gitlab.com/grogra/groimp-plugins/TexGen/",
        "vendor": "de.grogra",
        "mainClass": "",
        "versions" : {
            "2.1.2" : {
                "downloadUrl" : "https://gitlab.com/grogra/groimp-plugins/TexGen/-/package_files/105114476/download",
                "libs" : {
                },
                "depends" : {
                    "de.grogra.imp":"2.1.2",
                    "de.grogra.ray":"2.1.2"
                }
            },
            "2.1.3" : {
                "downloadUrl" : "https://gitlab.com/grogra/groimp-plugins/TexGen/-/package_files/122188770/download",
                "libs" : {
                },
                "depends" : {
                    "de.grogra.imp":"2.1.3",
                    "de.grogra.ray":"2.1.2"
                }
            }
        }
    }
]

