[
    {
        "id" : "de.grogra.ext.povray",
        "name" : "POV-Ray",
        "description" : "POV-Ray plugin enables import and export of the scene to a POV file. The export embeds the POV-Ray ray-tracer so that it can directly render in the 3D view. <br>It includes support of the file type : <br>- '.pov'",
        "helpUrl": "https://gitlab.com/grogra/groimp/",
        "vendor": "de.grogra",
        "mainClass": "",
        "versions" : {
            "2.1.2" : {
                "downloadUrl" : "https://gitlab.com/grogra/groimp/-/package_files/105114542/download",
                "libs" : {
                },
                "depends" : {
                    "de.grogra.imp3d":"2.1.2"
                }
            },
            "2.1.4" : {
                "downloadUrl" : "https://gitlab.com/grogra/groimp-plugins/POV-Ray/-/package_files/146336436/download",
                "libs" : {
                },
                "depends" : {
                    "de.grogra.imp3d":"2.1.4"
                }
            }
        }
    }
]

