[
    {
        "id" : "de.grogra.ext.exchangegraph",
        "name" : "ExchangeGraph",
        "description" : "Support interface of exchange graph object. Exchange graphs are graph that describe the same amount of topological and geometrical data as GroIMP graph. They can be used as intermediate graph to export/import sub graph between GroIMP projects. <br>During the export, Exchange graphs serialize the instanciation rules to add them to the graph.<br>It includes support of the file types (for import & export): <br>- '.xeg'",
        "helpUrl": "https://gitlab.com/grogra/groimp-plugins/ExchangeGraph/",
        "vendor": "de.grogra",
        "mainClass": "",
        "versions" : {
            "2.1.2" : {
                "downloadUrl" : "https://gitlab.com/grogra/groimp-plugins/ExchangeGraph/-/package_files/105122524/download",
                "libs" : {
		"xmlbeans.jar" :"https://repo1.maven.org/maven2/org/apache/xmlbeans/xmlbeans/5.2.0/xmlbeans-5.2.0.jar",
                "xegxmlbeans.jar" :"https://gitlab.com/grogra/misc_libraries/-/package_files/105383381/download"
                },
                "depends" : {
                    "de.grogra.grammar":"2.1.2",
                    "de.grogra.rgg":"2.1.2",
                    "de.grogra.imp3d":"2.1.2",
                    "de.grogra.pf":"2.1.2",
                    "de.grogra.xl":"2.1.2"
                }
            },
            "2.1.3" : {
                "downloadUrl" : "https://gitlab.com/grogra/groimp-plugins/ExchangeGraph/-/package_files/122191862/download",
                "libs" : {
                "xmlbeans.jar" :"https://repo1.maven.org/maven2/org/apache/xmlbeans/xmlbeans/5.2.0/xmlbeans-5.2.0.jar",
                "xegxmlbeans.jar" :"https://gitlab.com/grogra/misc_libraries/-/package_files/105383381/download"
                },
                "depends" : {
                    "de.grogra.grammar":"2.1.3",
                    "de.grogra.rgg":"2.1.3",
                    "de.grogra.imp3d":"2.1.3",
                    "de.grogra.pf":"2.1.3",
                    "de.grogra.xl":"2.1.3"
                }
            },
            "2.1.4" : {
                "downloadUrl" : "https://gitlab.com/grogra/groimp-plugins/ExchangeGraph/-/package_files/175361914/download",
                "libs" : {
                "xmlbeans.jar" :"https://repo1.maven.org/maven2/org/apache/xmlbeans/xmlbeans/5.2.0/xmlbeans-5.2.0.jar",
                "xegxmlbeans.jar" :"https://gitlab.com/grogra/misc_libraries/-/package_files/105383381/download"
                },
                "depends" : {
                    "de.grogra.grammar":"2.1.3",
                    "de.grogra.rgg":"2.1.6",
                    "de.grogra.imp3d":"2.1.6",
                    "de.grogra.pf":"2.1.6",
                    "de.grogra.xl":"2.1.6"
                }
            }
        }
    }
]

