{
  "plugins" : [
    "stylelint-scss"
  ],
  "defaultSeverity": "error",
  "rules": {
    "block-no-empty": true,
    "color-no-invalid-hex": true,
    "comment-empty-line-before": [ "always",
      { "ignore": ["stylelint-commands", "after-comment"] } ],
    "declaration-colon-space-after": "always",
    "indentation": [ 4,
      { "except": ["value"] } ],
    "max-empty-lines": 2,
    "rule-empty-line-before": ["always",
      { "except": ["first-nested"], "ignore": ["after-comment"] } ],
    "unit-whitelist": ["em", "rem", "%", "s", "px", "cm", "deg", "fr"]
  }
}