<?xml version="1.0" encoding="UTF-8" standalone="no"?>
<!DOCTYPE svg PUBLIC "-//W3C//DTD SVG 1.1//EN" "http://www.w3.org/Graphics/SVG/1.1/DTD/svg11.dtd">
<svg width="100%" height="100%" viewBox="0 0 32 32" version="1.1" xmlns="http://www.w3.org/2000/svg" xmlns:xlink="http://www.w3.org/1999/xlink" xml:space="preserve" xmlns:serif="http://www.serif.com/" style="fill-rule:evenodd;clip-rule:evenodd;stroke-linejoin:round;stroke-miterlimit:2;">
    <g transform="matrix(1.12237,0,0,1.12237,-3.10643,-2.74945)">
        <path d="M29.497,5.479C29.497,4.791 28.938,4.232 28.25,4.232L5.797,4.232C5.109,4.232 4.55,4.791 4.55,5.479L4.55,27.932C4.55,28.62 5.109,29.179 5.797,29.179L28.25,29.179C28.938,29.179 29.497,28.62 29.497,27.932L29.497,5.479Z" style="fill:rgb(27,27,27);"/>
    </g>
    <g transform="matrix(0.773762,0,0,0.773762,-1.94128,4.59739)">
        <text x="7.892px" y="8.838px" style="font-family:'ArialMT', 'Arial', sans-serif;font-size:8.616px;fill:rgb(255,250,228);">W<tspan x="17.128px 24.934px 32.26px " y="8.838px 8.838px 8.838px ">ORD</tspan></text>
        <text x="7.892px" y="24.993px" style="font-family:'ArialMT', 'Arial', sans-serif;font-size:8.616px;fill:rgb(255,250,228);">C<tspan x="14.341px 19.359px 26.287px 32.735px " y="24.993px 24.993px 24.993px 24.993px ">LOCK</tspan></text>
    </g>
</svg>
