(kicad_pcb (version 20211014) (generator pcbnew)

  (general
    (thickness 1.6)
  )

  (paper "A4")
  (title_block
    (title "Wordclock")
    (rev "1.0")
  )

  (layers
    (0 "F.Cu" signal)
    (31 "B.Cu" signal)
    (32 "B.Adhes" user "B.Adhesive")
    (33 "F.Adhes" user "F.Adhesive")
    (34 "B.Paste" user)
    (35 "F.Paste" user)
    (36 "B.SilkS" user "B.Silkscreen")
    (37 "F.SilkS" user "F.Silkscreen")
    (38 "B.Mask" user)
    (39 "F.Mask" user)
    (40 "Dwgs.User" user "User.Drawings")
    (41 "Cmts.User" user "User.Comments")
    (42 "Eco1.User" user "User.Eco1")
    (43 "Eco2.User" user "User.Eco2")
    (44 "Edge.Cuts" user)
    (45 "Margin" user)
    (46 "B.CrtYd" user "B.Courtyard")
    (47 "F.CrtYd" user "F.Courtyard")
    (48 "B.Fab" user)
    (49 "F.Fab" user)
    (50 "User.1" user)
    (51 "User.2" user)
    (52 "User.3" user)
    (53 "User.4" user)
    (54 "User.5" user)
    (55 "User.6" user)
    (56 "User.7" user)
    (57 "User.8" user)
    (58 "User.9" user)
  )

  (setup
    (stackup
      (layer "F.SilkS" (type "Top Silk Screen"))
      (layer "F.Paste" (type "Top Solder Paste"))
      (layer "F.Mask" (type "Top Solder Mask") (thickness 0.01))
      (layer "F.Cu" (type "copper") (thickness 0.035))
      (layer "dielectric 1" (type "core") (thickness 1.51) (material "FR4") (epsilon_r 4.5) (loss_tangent 0.02))
      (layer "B.Cu" (type "copper") (thickness 0.035))
      (layer "B.Mask" (type "Bottom Solder Mask") (thickness 0.01))
      (layer "B.Paste" (type "Bottom Solder Paste"))
      (layer "B.SilkS" (type "Bottom Silk Screen"))
      (copper_finish "None")
      (dielectric_constraints no)
    )
    (pad_to_mask_clearance 0)
    (pcbplotparams
      (layerselection 0x00010fc_ffffffff)
      (disableapertmacros false)
      (usegerberextensions false)
      (usegerberattributes true)
      (usegerberadvancedattributes true)
      (creategerberjobfile true)
      (svguseinch false)
      (svgprecision 6)
      (excludeedgelayer true)
      (plotframeref false)
      (viasonmask false)
      (mode 1)
      (useauxorigin false)
      (hpglpennumber 1)
      (hpglpenspeed 20)
      (hpglpendiameter 15.000000)
      (dxfpolygonmode true)
      (dxfimperialunits true)
      (dxfusepcbnewfont true)
      (psnegative false)
      (psa4output false)
      (plotreference true)
      (plotvalue true)
      (plotinvisibletext false)
      (sketchpadsonfab false)
      (subtractmaskfromsilk false)
      (outputformat 1)
      (mirror false)
      (drillshape 1)
      (scaleselection 1)
      (outputdirectory "")
    )
  )

  (net 0 "")
  (net 1 "+5V")
  (net 2 "Net-(J2-Pad1)")
  (net 3 "GNDREF")
  (net 4 "unconnected-(U1-Pad1)")
  (net 5 "unconnected-(U1-Pad2)")
  (net 6 "unconnected-(U1-Pad4)")
  (net 7 "unconnected-(U1-Pad6)")
  (net 8 "unconnected-(U1-Pad7)")
  (net 9 "unconnected-(U1-Pad8)")
  (net 10 "unconnected-(U1-Pad9)")
  (net 11 "unconnected-(U1-Pad10)")
  (net 12 "unconnected-(U1-Pad11)")
  (net 13 "unconnected-(U1-Pad12)")
  (net 14 "unconnected-(U1-Pad13)")
  (net 15 "unconnected-(U1-Pad14)")
  (net 16 "unconnected-(U1-Pad15)")
  (net 17 "Net-(U1-Pad16)")
  (net 18 "unconnected-(U1-Pad17)")
  (net 19 "unconnected-(U1-Pad19)")
  (net 20 "unconnected-(U1-Pad21)")
  (net 21 "unconnected-(U1-Pad22)")
  (net 22 "unconnected-(U1-Pad23)")
  (net 23 "unconnected-(U1-Pad24)")
  (net 24 "unconnected-(U1-Pad25)")
  (net 25 "unconnected-(U1-Pad26)")
  (net 26 "unconnected-(U1-Pad27)")
  (net 27 "unconnected-(U1-Pad28)")
  (net 28 "unconnected-(U1-Pad29)")
  (net 29 "unconnected-(U1-Pad30)")
  (net 30 "unconnected-(U1-Pad32)")
  (net 31 "unconnected-(U1-Pad33)")
  (net 32 "unconnected-(U1-Pad34)")
  (net 33 "unconnected-(U1-Pad35)")
  (net 34 "+3.3V")
  (net 35 "unconnected-(U1-Pad37)")
  (net 36 "unconnected-(U1-Pad38)")
  (net 37 "unconnected-(U1-Pad40)")
  (net 38 "unconnected-(U1-Pad41)")
  (net 39 "unconnected-(U1-Pad42)")
  (net 40 "unconnected-(U1-Pad43)")
  (net 41 "unconnected-(U2-Pad4)")
  (net 42 "unconnected-(U2-Pad5)")
  (net 43 "unconnected-(U2-Pad6)")
  (net 44 "unconnected-(U2-Pad8)")
  (net 45 "unconnected-(U2-Pad9)")
  (net 46 "unconnected-(U2-Pad10)")
  (net 47 "unconnected-(U2-Pad11)")
  (net 48 "unconnected-(U2-Pad12)")
  (net 49 "unconnected-(U2-Pad13)")
  (net 50 "Net-(D2-Pad1)")
  (net 51 "Net-(D1-Pad1)")
  (net 52 "unconnected-(J2-Pad2)")
  (net 53 "Net-(R1-Pad2)")
  (net 54 "unconnected-(U1-Pad5)")
  (net 55 "unconnected-(U1-Pad20)")
  (net 56 "unconnected-(U1-Pad3)")

  (footprint "Connector_PinHeader_2.54mm:PinHeader_1x02_P2.54mm_Horizontal" (layer "F.Cu")
    (tedit 59FED5CB) (tstamp 6b013cb8-9e09-4a62-b02d-814d5cfa604e)
    (at 63.488478 116.766992 -90)
    (descr "Through hole angled pin header, 1x02, 2.54mm pitch, 6mm pin length, single row")
    (tags "Through hole angled pin header THT 1x02 2.54mm single row")
    (property "Sheetfile" "wordclock.kicad_sch")
    (property "Sheetname" "")
    (path "/7f297588-a058-41f4-afe9-cfcb5cfd18a2")
    (attr through_hole)
    (fp_text reference "J1" (at 4.385 -2.27 90) (layer "F.SilkS")
      (effects (font (size 1 1) (thickness 0.15)))
      (tstamp 38efeb53-4219-4d99-b1d1-0a3856681a78)
    )
    (fp_text value "Power Input" (at -2.766992 1.088478) (layer "F.Fab")
      (effects (font (size 1 1) (thickness 0.15)))
      (tstamp 89003258-54a3-4ec2-adbc-e25c47830bcf)
    )
    (fp_text user "${REFERENCE}" (at 2.77 1.27) (layer "F.Fab")
      (effects (font (size 1 1) (thickness 0.15)))
      (tstamp 0d18bc04-ceb5-4cd5-93be-658d979cf9b6)
    )
    (fp_line (start 1.44 -1.33) (end 1.44 3.87) (layer "F.SilkS") (width 0.12) (tstamp 049efcca-4c85-465f-a7b7-45413e5fa5d6))
    (fp_line (start 4.1 0.16) (end 10.1 0.16) (layer "F.SilkS") (width 0.12) (tstamp 0f0617bc-06f3-4ccf-b60d-0d949ebd7bb7))
    (fp_line (start 4.1 2.16) (end 10.1 2.16) (layer "F.SilkS") (width 0.12) (tstamp 0f27bb2d-ad8e-4557-abfb-e3ac4b0a9e36))
    (fp_line (start 1.042929 2.92) (end 1.44 2.92) (layer "F.SilkS") (width 0.12) (tstamp 1ceb71c4-21b4-4401-8de0-113b18184643))
    (fp_line (start 1.44 1.27) (end 4.1 1.27) (layer "F.SilkS") (width 0.12) (tstamp 23e2adec-786a-4f8e-b554-c8b6b88104f6))
    (fp_line (start 1.44 3.87) (end 4.1 3.87) (layer "F.SilkS") (width 0.12) (tstamp 243888ed-1559-4569-b53d-317bf93bcaac))
    (fp_line (start 4.1 -0.08) (end 10.1 -0.08) (layer "F.SilkS") (width 0.12) (tstamp 2e9e141a-54ba-4152-a37a-41e03161a928))
    (fp_line (start 10.1 -0.38) (end 10.1 0.38) (layer "F.SilkS") (width 0.12) (tstamp 31e494ea-4f3e-4a89-8b23-d516a4ba1b7e))
    (fp_line (start 1.11 0.38) (end 1.44 0.38) (layer "F.SilkS") (width 0.12) (tstamp 3fa18a7a-a8a1-4e42-8db6-df497d4fd410))
    (fp_line (start 10.1 2.16) (end 10.1 2.92) (layer "F.SilkS") (width 0.12) (tstamp 41eb5747-7d60-4068-811f-a84b81efc9dd))
    (fp_line (start 4.1 -0.2) (end 10.1 -0.2) (layer "F.SilkS") (width 0.12) (tstamp 4672c675-b104-467c-8e89-173bc43abcf9))
    (fp_line (start 1.042929 2.16) (end 1.44 2.16) (layer "F.SilkS") (width 0.12) (tstamp 62a32d55-5dd6-4101-b28a-f478d444539c))
    (fp_line (start 10.1 0.38) (end 4.1 0.38) (layer "F.SilkS") (width 0.12) (tstamp 67bba064-96d9-4baa-8fab-30fc7ce1572a))
    (fp_line (start 4.1 -0.32) (end 10.1 -0.32) (layer "F.SilkS") (width 0.12) (tstamp 88730b9f-db89-4150-8925-d5c8ecd6e8d1))
    (fp_line (start -1.27 0) (end -1.27 -1.27) (layer "F.SilkS") (width 0.12) (tstamp 97864ba0-2cf1-4e4a-a21a-348acaabc3fe))
    (fp_line (start -1.27 -1.27) (end 0 -1.27) (layer "F.SilkS") (width 0.12) (tstamp 9beedeea-76dc-44f0-ac4a-d8f5d519101a))
    (fp_line (start 4.1 -0.38) (end 10.1 -0.38) (layer "F.SilkS") (width 0.12) (tstamp 9c116d63-5ac9-40fc-a52d-96a66fa424f9))
    (fp_line (start 1.11 -0.38) (end 1.44 -0.38) (layer "F.SilkS") (width 0.12) (tstamp ab7e4f62-073d-4dfd-8975-5f0733fb7ad5))
    (fp_line (start 10.1 2.92) (end 4.1 2.92) (layer "F.SilkS") (width 0.12) (tstamp c3485c40-2a3f-4d60-9159-5a497e0210dd))
    (fp_line (start 4.1 0.28) (end 10.1 0.28) (layer "F.SilkS") (width 0.12) (tstamp ddceb510-327a-43ec-a3b4-861d6a13866d))
    (fp_line (start 4.1 -1.33) (end 1.44 -1.33) (layer "F.SilkS") (width 0.12) (tstamp eb088c2d-87c0-4050-970a-2e429533c167))
    (fp_line (start 4.1 0.04) (end 10.1 0.04) (layer "F.SilkS") (width 0.12) (tstamp f3d9b5b0-a80d-4914-84a9-edf7c0d07f1f))
    (fp_line (start 4.1 3.87) (end 4.1 -1.33) (layer "F.SilkS") (width 0.12) (tstamp f5139a4e-68fb-4e53-8248-0fde82429746))
    (fp_line (start -1.8 -1.8) (end -1.8 4.35) (layer "F.CrtYd") (width 0.05) (tstamp 505112fb-86e8-4fd0-8d77-a346abdb4dbe))
    (fp_line (start 10.55 4.35) (end 10.55 -1.8) (layer "F.CrtYd") (width 0.05) (tstamp a84e4906-bdff-4091-85a9-fb5dd6d337d7))
    (fp_line (start 10.55 -1.8) (end -1.8 -1.8) (layer "F.CrtYd") (width 0.05) (tstamp acc6e2d4-675b-4006-97b5-beb36e01997b))
    (fp_line (start -1.8 4.35) (end 10.55 4.35) (layer "F.CrtYd") (width 0.05) (tstamp b4647ab4-d308-47e1-9571-b658eb7b8bf7))
    (fp_line (start -0.32 2.86) (end 1.5 2.86) (layer "F.Fab") (width 0.1) (tstamp 07b6b924-5cba-4166-99b0-badd2a0b44e1))
    (fp_line (start 4.04 2.86) (end 10.04 2.86) (layer "F.Fab") (width 0.1) (tstamp 0c460b73-2248-41ab-9b4f-ccbca4318d95))
    (fp_line (start 1.5 -0.635) (end 2.135 -1.27) (layer "F.Fab") (width 0.1) (tstamp 10f3dfcf-9db2-4e9a-a434-d2de041151c4))
    (fp_line (start 10.04 2.22) (end 10.04 2.86) (layer "F.Fab") (width 0.1) (tstamp 1943da9f-d525-468f-bf0c-d83f83174a13))
    (fp_line (start -0.32 0.32) (end 1.5 0.32) (layer "F.Fab") (width 0.1) (tstamp 28972a4b-6974-48f6-b4be-01e872ffbc5e))
    (fp_line (start 4.04 3.81) (end 1.5 3.81) (layer "F.Fab") (width 0.1) (tstamp 3809de13-4a90-4b1b-938c-120c43780965))
    (fp_line (start 4.04 2.22) (end 10.04 2.22) (layer "F.Fab") (width 0.1) (tstamp 42e8096c-4084-49ac-8373-d08bf5b3deba))
    (fp_line (start 1.5 3.81) (end 1.5 -0.635) (layer "F.Fab") (width 0.1) (tstamp 538e4811-133d-4ccd-a738-a0d0cd4d1d5e))
    (fp_line (start 2.135 -1.27) (end 4.04 -1.27) (layer "F.Fab") (width 0.1) (tstamp 5fbce9cc-9fc8-4da6-abeb-0e46182b75bc))
    (fp_line (start -0.32 -0.32) (end -0.32 0.32) (layer "F.Fab") (width 0.1) (tstamp 616c5bb8-cb39-417d-8bca-d2420cf4084c))
    (fp_line (start -0.32 2.22) (end -0.32 2.86) (layer "F.Fab") (width 0.1) (tstamp 8f84be1c-2e8a-427d-8482-a9872a7e37ff))
    (fp_line (start -0.32 2.22) (end 1.5 2.22) (layer "F.Fab") (width 0.1) (tstamp 953f9b16-b3a3-4d81-a150-48a8154877a9))
    (fp_line (start 4.04 0.32) (end 10.04 0.32) (layer "F.Fab") (width 0.1) (tstamp 9d8d4465-159b-4712-a568-e61403e1bd3b))
    (fp_line (start 4.04 -0.32) (end 10.04 -0.32) (layer "F.Fab") (width 0.1) (tstamp be24e651-447f-4e99-b129-1071cfec403e))
    (fp_line (start -0.32 -0.32) (end 1.5 -0.32) (layer "F.Fab") (width 0.1) (tstamp c7f2dc13-fd88-40df-a579-6f2e1cb073f5))
    (fp_line (start 10.04 -0.32) (end 10.04 0.32) (layer "F.Fab") (width 0.1) (tstamp d5243572-59e2-4092-92c3-2ac480ff5c93))
    (fp_line (start 4.04 -1.27) (end 4.04 3.81) (layer "F.Fab") (width 0.1) (tstamp f9bea0bb-094c-478f-893b-a633897dc1b8))
    (pad "1" thru_hole rect (at 0 0 270) (size 1.7 1.7) (drill 1) (layers *.Cu *.Mask)
      (net 1 "+5V") (pintype "passive") (tstamp b816b256-8945-4acc-be22-9e2a11213e4a))
    (pad "2" thru_hole oval (at 0 2.54 270) (size 1.7 1.7) (drill 1) (layers *.Cu *.Mask)
      (net 3 "GNDREF") (pintype "passive") (tstamp 2c747b1d-b964-4bb5-ae99-1b77bb076c9f))
    (model "${KICAD6_3DMODEL_DIR}/Connector_PinHeader_2.54mm.3dshapes/PinHeader_1x02_P2.54mm_Horizontal.wrl"
      (offset (xyz 0 0 0))
      (scale (xyz 1 1 1))
      (rotate (xyz 0 0 0))
    )
  )

  (footprint "TerminalBlock_Phoenix:TerminalBlock_Phoenix_MPT-0,5-2-2.54_1x02_P2.54mm_Horizontal" (layer "F.Cu")
    (tedit 5B294F98) (tstamp 6d03d44b-d1b0-4f64-aef9-17f862c08336)
    (at 55.860394 86.340394 90)
    (descr "Terminal Block Phoenix MPT-0,5-2-2.54, 2 pins, pitch 2.54mm, size 5.54x6.2mm^2, drill diamater 1.1mm, pad diameter 2.2mm, see http://www.mouser.com/ds/2/324/ItemDetail_1725656-920552.pdf, script-generated using https://github.com/pointhi/kicad-footprint-generator/scripts/TerminalBlock_Phoenix")
    (tags "THT Terminal Block Phoenix MPT-0,5-2-2.54 pitch 2.54mm size 5.54x6.2mm^2 drill 1.1mm pad 2.2mm")
    (property "Sheetfile" "wordclock.kicad_sch")
    (property "Sheetname" "")
    (path "/674118c1-e3df-4124-9d52-7a51d8b6efc4")
    (attr through_hole)
    (fp_text reference "J2" (at 1.27 -4.16 90) (layer "F.SilkS")
      (effects (font (size 1 1) (thickness 0.15)))
      (tstamp 6c172555-c320-4ae1-8b43-044de7eda6b9)
    )
    (fp_text value "LED strip out" (at -2.959606 1.339606) (layer "F.Fab")
      (effects (font (size 1 1) (thickness 0.15)))
      (tstamp 48d2f325-536b-44ff-bfb5-78286e33d0aa)
    )
    (fp_text user "${REFERENCE}" (at 1.27 2 90) (layer "F.Fab")
      (effects (font (size 1 1) (thickness 0.15)))
      (tstamp 5f184fe8-a700-400d-bda4-ed3b719e5893)
    )
    (fp_line (start -1.8 3.4) (end -1.3 3.4) (layer "F.SilkS") (width 0.12) (tstamp 1428ae5b-89ba-4499-97fc-1ab61238927d))
    (fp_line (start -1.56 -3.16) (end 4.1 -3.16) (layer "F.SilkS") (width 0.12) (tstamp 171b57f5-9089-46cd-9842-f0043251f92e))
    (fp_line (start -1.56 -2.7) (end 4.1 -2.7) (layer "F.SilkS") (width 0.12) (tstamp 247a10e8-47a3-4f71-9769-d9949aaa16b0))
    (fp_line (start 3.33 2.6) (end 4.1 2.6) (layer "F.SilkS") (width 0.12) (tstamp 3e38e43e-ec41-450e-8360-40344671f835))
    (fp_line (start 0.79 3.16) (end 1.75 3.16) (layer "F.SilkS") (width 0.12) (tstamp 40bd8b82-c069-41f0-911f-47397f9aabd8))
    (fp_line (start 0.79 2.6) (end 1.75 2.6) (layer "F.SilkS") (width 0.12) (tstamp 41cdc8a5-1dd3-4da5-baad-3cad8ac48649))
    (fp_line (start -1.56 -3.16) (end -1.56 3.16) (layer "F.SilkS") (width 0.12) (tstamp 484a2766-f0c8-496f-adbc-b2e83d39e8ed))
    (fp_line (start -1.56 3.16) (end -0.79 3.16) (layer "F.SilkS") (width 0.12) (tstamp de180ffc-3a6e-4a65-ab2c-90a4360b215c))
    (fp_line (start 3.33 3.16) (end 4.1 3.16) (layer "F.SilkS") (width 0.12) (tstamp e4d6a092-7dbd-43ec-b381-c1f8f1be6a09))
    (fp_line (start -1.8 2.66) (end -1.8 3.4) (layer "F.SilkS") (width 0.12) (tstamp e7ea6434-26aa-410f-a8e6-19a5a8d66ea2))
    (fp_line (start -1.56 2.6) (end -0.79 2.6) (layer "F.SilkS") (width 0.12) (tstamp e8b7aaac-70d3-4ea8-bb06-9794e83d1dc1))
    (fp_line (start 4.1 -3.16) (end 4.1 3.16) (layer "F.SilkS") (width 0.12) (tstamp f4edc571-48e2-43ad-8934-0d039b54f784))
    (fp_line (start -2 -3.6) (end -2 3.6) (layer "F.CrtYd") (width 0.05) (tstamp 5dd81566-aa0e-4c62-8fc8-95937c7449de))
    (fp_line (start -2 3.6) (end 4.54 3.6) (layer "F.CrtYd") (width 0.05) (tstamp 81d7b1cf-9a43-4a46-a1b7-356ce95168e1))
    (fp_line (start 4.54 3.6) (end 4.54 -3.6) (layer "F.CrtYd") (width 0.05) (tstamp 914a1f33-d949-4037-b6ab-7ccfe94be2df))
    (fp_line (start 4.54 -3.6) (end -2 -3.6) (layer "F.CrtYd") (width 0.05) (tstamp e8e3fd80-af06-47bb-b5e6-9f33df7ab689))
    (fp_line (start 4.04 -3.1) (end 4.04 3.1) (layer "F.Fab") (width 0.1) (tstamp 31c68f13-89e5-4b7f-aab5-ff35f9a7e411))
    (fp_line (start -1 3.1) (end -1.5 2.6) (layer "F.Fab") (width 0.1) (tstamp 3d957f69-5fdd-427d-bcc0-8d079d676cca))
    (fp_line (start -1.5 -3.1) (end 4.04 -3.1) (layer "F.Fab") (width 0.1) (tstamp 6ee8e03d-3875-4bc8-86b7-c3929d353d50))
    (fp_line (start 0.701 -0.835) (end -0.835 0.7) (layer "F.Fab") (width 0.1) (tstamp 838d69e2-3ab1-4610-9e1c-9469219788d0))
    (fp_line (start 3.375 -0.7) (end 1.84 0.835) (layer "F.Fab") (width 0.1) (tstamp 89f45513-38bc-4933-8fa7-87bd7d888cf1))
    (fp_line (start 0.835 -0.7) (end -0.701 0.835) (layer "F.Fab") (width 0.1) (tstamp a1084cdb-cf5e-4c32-a340-df65894e0c0e))
    (fp_line (start -1.5 2.6) (end -1.5 -3.1) (layer "F.Fab") (width 0.1) (tstamp b2df31ea-f8d8-459e-bfc0-eb9493f3925c))
    (fp_line (start 3.241 -0.835) (end 1.706 0.7) (layer "F.Fab") (width 0.1) (tstamp ba447855-a928-429a-9382-3641a4ca8b16))
    (fp_line (start -1.5 -2.7) (end 4.04 -2.7) (layer "F.Fab") (width 0.1) (tstamp d8868bae-e4c1-4796-bba5-4c2f14a7a081))
    (fp_line (start 4.04 3.1) (end -1 3.1) (layer "F.Fab") (width 0.1) (tstamp dd95bd80-c2c9-4649-a9cd-351e64130458))
    (fp_line (start -1.5 2.6) (end 4.04 2.6) (layer "F.Fab") (width 0.1) (tstamp f3f8ef9b-694a-4d72-9d71-a9c19a534ad6))
    (fp_circle (center 0 0) (end 1.1 0) (layer "F.Fab") (width 0.1) (fill none) (tstamp 0368de0e-64a7-4dcc-aabc-a827832d91c5))
    (fp_circle (center 2.54 0) (end 3.64 0) (layer "F.Fab") (width 0.1) (fill none) (tstamp 92dd4090-449e-426a-b860-5419cdfd388f))
    (pad "" np_thru_hole circle (at 0 2.54 90) (size 1.1 1.1) (drill 1.1) (layers *.Cu *.Mask) (tstamp 67c5ed30-e4cc-4dcb-a867-ba0e95af4677))
    (pad "" np_thru_hole circle (at 2.54 2.54 90) (size 1.1 1.1) (drill 1.1) (layers *.Cu *.Mask) (tstamp 863a5314-96f4-4954-bf5e-e688db8d65e6))
    (pad "1" thru_hole rect (at 0 0 90) (size 2.2 2.2) (drill 1.1) (layers *.Cu *.Mask)
      (net 2 "Net-(J2-Pad1)") (pinfunction "Pin_1") (pintype "passive") (tstamp 243ec770-cc5a-4509-9c36-eb8c7bb8645d))
    (pad "2" thru_hole circle (at 2.54 0 90) (size 2.2 2.2) (drill 1.1) (layers *.Cu *.Mask)
      (net 52 "unconnected-(J2-Pad2)") (pinfunction "Pin_2") (pintype "passive") (tstamp 84d801cf-c25f-4791-81e9-de8135a35f0b))
    (model "${KICAD6_3DMODEL_DIR}/TerminalBlock_Phoenix.3dshapes/TerminalBlock_Phoenix_MPT-0,5-2-2.54_1x02_P2.54mm_Horizontal.wrl"
      (offset (xyz 0 0 0))
      (scale (xyz 1 1 1))
      (rotate (xyz 0 0 0))
    )
  )

  (footprint "74HCT32:CD74HCT32E" (layer "F.Cu")
    (tedit 0) (tstamp 751d823e-1d7b-4501-9658-d06d459b0e16)
    (at 68.603198 104.163878 -90)
    (property "Sheetfile" "wordclock.kicad_sch")
    (property "Sheetname" "")
    (path "/3c67fde7-a45e-4b4a-976b-eb6a7ef2c860")
    (attr through_hole)
    (fp_text reference "U2" (at 2.9464 7.648226) (layer "F.SilkS")
      (effects (font (size 1 1) (thickness 0.15)))
      (tstamp dec284d9-246c-4619-8dcc-8f4886f9349e)
    )
    (fp_text value "74HCT32" (at 4.826 7.546626) (layer "F.SilkS")
      (effects (font (size 1 1) (thickness 0.15)))
      (tstamp ae8bb5ae-95ee-4e2d-8a0c-ae5b6149b4e3)
    )
    (fp_text user "*" (at 0 -1.4097 90) (layer "F.SilkS")
      (effects (font (size 1 1) (thickness 0.15)))
      (tstamp 099473f1-6598-46ff-a50f-4c520832170d)
    )
    (fp_text user "*" (at 0 -1.4097 90) (layer "F.SilkS")
      (effects (font (size 1 1) (thickness 0.15)))
      (tstamp 15699041-ed40-45ee-87d8-f5e206a88536)
    )
    (fp_text user "Copyright 2021 Accelerated Designs. All rights reserved." (at 0 0 90) (layer "Cmts.User")
      (effects (font (size 0.127 0.127) (thickness 0.002)))
      (tstamp 1876c30c-72b2-4a8d-9f32-bf8b213530b4)
    )
    (fp_text user "*" (at 0.762 0 90) (layer "F.Fab")
      (effects (font (size 1 1) (thickness 0.15)))
      (tstamp 80095e91-6317-4cfb-9aea-884c9a1accc5)
    )
    (fp_text user "*" (at 0.762 0 90) (layer "F.Fab")
      (effects (font (size 1 1) (thickness 0.15)))
      (tstamp ca9b74ce-0dee-401c-9544-f599f4cf538d)
    )
    (fp_line (start 7.239 11.796617) (end 7.239 11.063383) (layer "F.SilkS") (width 0.12) (tstamp 165f4d8d-26a9-4cf2-a8d6-9936cd983be4))
    (fp_line (start 7.239 17.5895) (end 7.239 16.143383) (layer "F.SilkS") (width 0.12) (tstamp 25c663ff-96b6-4263-a06e-d1829409cf73))
    (fp_line (start 0.381 17.5895) (end 7.239 17.5895) (layer "F.SilkS") (width 0.12) (tstamp 34ce7009-187e-4541-a14e-708b3a2903d9))
    (fp_line (start 0.381 0.98044) (end 0.381 1.636617) (layer "F.SilkS") (width 0.12) (tstamp 49a65079-57a9-46fc-8711-1d7f2cab8dbf))
    (fp_line (start 0.381 13.603383) (end 0.381 14.336617) (layer "F.SilkS") (width 0.12) (tstamp 58cc7831-f944-4d33-8c61-2fd5bebc61e0))
    (fp_line (start 7.239 1.636617) (end 7.239 0.903383) (layer "F.SilkS") (width 0.12) (tstamp 59f60168-cced-43c9-aaa5-41a1a8a2f631))
    (fp_line (start 7.239 -2.3495) (end 0.381 -2.3495) (layer "F.SilkS") (width 0.12) (tstamp 637e9edf-ffed-49a2-8408-fa110c9a4c79))
    (fp_line (start 0.381 5.983383) (end 0.381 6.716617) (layer "F.SilkS") (width 0.12) (tstamp 6ae963fb-e34f-4e11-9adf-78839a5b2ef1))
    (fp_line (start 7.239 6.716617) (end 7.239 5.983383) (layer "F.SilkS") (width 0.12) (tstamp 74855e0d-40e4-4940-a544-edae9207b2ea))
    (fp_line (start 0.381 3.443383) (end 0.381 4.176617) (layer "F.SilkS") (width 0.12) (tstamp 87ba184f-bff5-4989-8217-6af375cc3dd8))
    (fp_line (start 7.239 9.256617) (end 7.239 8.523383) (layer "F.SilkS") (width 0.12) (tstamp 8e697b96-cf4c-43ef-b321-8c2422b088bf))
    (fp_line (start 7.239 14.336617) (end 7.239 13.603383) (layer "F.SilkS") (width 0.12) (tstamp 92a23ed4-a5ea-4cea-bc33-0a83191a0d32))
    (fp_line (start 0.381 16.143383) (end 0.381 17.5895) (layer "F.SilkS") (width 0.12) (tstamp 9de304ba-fba7-4896-b969-9d87a3522d74))
    (fp_line (start 0.381 -2.3495) (end 0.381 -0.98044) (layer "F.SilkS") (width 0.12) (tstamp b456cffc-d9d7-4c91-91f2-36ec9a65dd1b))
    (fp_line (start 0.381 8.523383) (end 0.381 9.256617) (layer "F.SilkS") (width 0.12) (tstamp d45d1afe-78e6-4045-862c-b274469da903))
    (fp_line (start 7.239 4.176617) (end 7.239 3.443383) (layer "F.SilkS") (width 0.12) (tstamp d68dca9b-48b3-498b-9b5f-3b3838250f82))
    (fp_line (start 0.381 11.063383) (end 0.381 11.796617) (layer "F.SilkS") (width 0.12) (tstamp f203116d-f256-4611-a03e-9536bbedaf2f))
    (fp_line (start 7.239 -0.903383) (end 7.239 -2.3495) (layer "F.SilkS") (width 0.12) (tstamp f6a3288e-9575-42bb-af05-a920d59aded8))
    (fp_line (start 10.033 17.2085) (end 10.287 17.2085) (layer "Cmts.User") (width 0.1) (tstamp 000b46d6-b833-4804-8f56-56d539f76d09))
    (fp_line (start -2.667 2.794) (end -2.413 2.794) (layer "Cmts.User") (width 0.1) (tstamp 0c5dddf1-38df-43d2-b49c-e7b691dab0ab))
    (fp_line (start -2.54 2.54) (end -2.413 2.794) (layer "Cmts.User") (width 0.1) (tstamp 0ce1dd44-f307-4f98-9f0d-478fd87daa64))
    (fp_line (start 0 17.78) (end 0.254 17.653) (layer "Cmts.User") (width 0.1) (tstamp 1855ca44-ab48-4b76-a210-97fc81d916c4))
    (fp_line (start 0.508 15.24) (end 0.508 -2.921) (layer "Cmts.User") (width 0.1) (tstamp 1bf7d0f9-0dcf-4d7c-b58c-318e3dc42bc9))
    (fp_line (start 3.81 17.4625) (end 10.541 17.4625) (layer "Cmts.User") (width 0.1) (tstamp 1cacb878-9da4-41fc-aa80-018bc841e19a))
    (fp_line (start 10.16 -2.2225) (end 10.287 -1.9685) (layer "Cmts.User") (width 0.1) (tstamp 1de61170-5337-44c5-ba28-bd477db4bff1))
    (fp_line (start 0.508 -2.54) (end 0.762 -2.667) (layer "Cmts.User") (width 0.1) (tstamp 247ebffd-2cb6-4379-ba6e-21861fea3913))
    (fp_line (start 7.62 15.24) (end 7.62 18.161) (layer "Cmts.User") (width 0.1) (tstamp 254f7cc6-cee1-44ca-9afe-939b318201aa))
    (fp_line (start 0 17.78) (end 0.254 17.907) (layer "Cmts.User") (width 0.1) (tstamp 3457afc5-3e4f-4220-81d1-b079f653a722))
    (fp_line (start 10.033 -1.9685) (end 10.287 -1.9685) (layer "Cmts.User") (width 0.1) (tstamp 3a1a39fc-8030-4c93-9d9c-d79ba6824099))
    (fp_line (start 0 2.54) (end -2.921 2.54) (layer "Cmts.User") (width 0.1) (tstamp 3bbbbb7d-391c-4fee-ac81-3c47878edc38))
    (fp_line (start -2.667 -0.254) (end -2.413 -0.254) (layer "Cmts.User") (width 0.1) (tstamp 4970ec6e-3725-4619-b57d-dc2c2cb86ed0))
    (fp_line (start 10.16 17.4625) (end 10.033 17.2085) (layer "Cmts.User") (width 0.1) (tstamp 49b5f540-e128-4e08-bb09-f321f8e64056))
    (fp_line (start -2.54 0) (end -2.54 -1.27) (layer "Cmts.User") (width 0.1) (tstamp 4a53fa56-d65b-42a4-a4be-8f49c4c015bb))
    (fp_line (start 10.16 -2.2225) (end 10.16 17.4625) (layer "Cmts.User") (width 0.1) (tstamp 4ce9470f-5633-41bf-89ac-74a810939893))
    (fp_line (start 6.858 -2.667) (end 6.858 -2.413) (layer "Cmts.User") (width 0.1) (tstamp 51cc007a-3378-4ce3-909c-71e94822f8d1))
    (fp_line (start 3.81 -2.2225) (end 10.541 -2.2225) (layer "Cmts.User") (width 0.1) (tstamp 5576cd03-3bad-40c5-9316-1d286895d52a))
    (fp_line (start 7.62 17.78) (end 7.366 17.907) (layer "Cmts.User") (width 0.1) (tstamp 58390862-1833-41dd-9c4e-98073ea0da33))
    (fp_line (start 7.62 17.78) (end 7.366 17.653) (layer "Cmts.User") (width 0.1) (tstamp 5e755161-24a5-4650-a6e3-9836bf074412))
    (fp_line (start 0 17.78) (end 7.62 17.78) (layer "Cmts.User") (width 0.1) (tstamp 5f48b0f2-82cf-40ce-afac-440f97643c36))
    (fp_line (start -2.54 2.54) (end -2.54 3.81) (layer "Cmts.User") (width 0.1) (tstamp 6150c02b-beb5-4af1-951e-3666a285a6ea))
    (fp_line (start -2.54 0) (end -2.413 -0.254) (layer "Cmts.User") (width 0.1) (tstamp 755f94aa-38f0-4a64-a7c7-6c71cb18cddf))
    (fp_line (start 0.762 -2.667) (end 0.762 -2.413) (layer "Cmts.User") (width 0.1) (tstamp 83184391-76ed-44f0-8cd0-01f89f157bdb))
    (fp_line (start 7.366 17.653) (end 7.366 17.907) (layer "Cmts.User") (width 0.1) (tstamp 9208ea78-8dde-4b3d-91e9-5755ab5efd9a))
    (fp_line (start 0.508 -2.54) (end 7.112 -2.54) (layer "Cmts.User") (width 0.1) (tstamp 94d24676-7ae3-483c-8bd6-88d31adf00b4))
    (fp_line (start 0.508 -2.54) (end 0.762 -2.413) (layer "Cmts.User") (width 0.1) (tstamp 966ee9ec-860e-45bb-af89-30bda72b2032))
    (fp_line (start 7.112 -2.54) (end 6.858 -2.413) (layer "Cmts.User") (width 0.1) (tstamp 96ef76a5-90c3-4767-98ba-2b61887e28d3))
    (fp_line (start -2.54 0) (end -2.667 -0.254) (layer "Cmts.User") (width 0.1) (tstamp 9c2999b2-1cf1-4204-9d23-243401b77aa3))
    (fp_line (start 0 0) (end -2.921 0) (layer "Cmts.User") (width 0.1) (tstamp 9ed09117-33cf-45a3-85a7-2606522feaf8))
    (fp_line (start 10.16 -2.2225) (end 10.033 -1.9685) (layer "Cmts.User") (width 0.1) (tstamp aa23bfe3-454b-4a2b-bfe1-101c747eb84e))
    (fp_line (start 0 15.24) (end 0 18.161) (layer "Cmts.User") (width 0.1) (tstamp ca56e1ad-54bf-4df5-a4f7-99f5d61d0de9))
    (fp_line (start 7.112 -2.54) (end 6.858 -2.667) (layer "Cmts.User") (width 0.1) (tstamp db6412d3-e6c3-4bdd-abf4-a8f55d56df31))
    (fp_line (start 10.16 17.4625) (end 10.287 17.2085) (layer "Cmts.User") (width 0.1) (tstamp dd70858b-2f9a-4b3f-9af5-ead3a9ba57e9))
    (fp_line (start 7.112 15.24) (end 7.112 -2.921) (layer "Cmts.User") (width 0.1) (tstamp e45aa7d8-0254-4176-afd9-766820762e19))
    (fp_line (start 0.254 17.653) (end 0.254 17.907) (layer "Cmts.User") (width 0.1) (tstamp e86e4fae-9ca7-4857-a93c-bc6a3048f887))
    (fp_line (start -2.54 2.54) (end -2.667 2.794) (layer "Cmts.User") (width 0.1) (tstamp f8b47531-6c06-4e54-9fc9-cd9d0f3dd69f))
    (fp_line (start 7.366 -0.9017) (end 7.366 -2.4765) (layer "F.CrtYd") (width 0.05) (tstamp 082aed28-f9e8-49e7-96ee-b5aa9f0319c7))
    (fp_line (start 8.5217 -0.9017) (end 7.366 -0.9017) (layer "F.CrtYd") (width 0.05) (tstamp 10b20c6b-8045-46d1-a965-0d7dd9a1b5fa))
    (fp_line (start -0.9017 -0.9017) (end 0.254 -0.9017) (layer "F.CrtYd") (width 0.05) (tstamp 26a22c19-4cc5-4237-9651-0edc4f854154))
    (fp_line (start 8.5217 16.1417) (end 7.366 16.1417) (layer "F.CrtYd") (width 0.05) (tstamp 3b65c51e-c243-447e-bee9-832d94c1630e))
    (fp_line (start 8.5217 -0.9017) (end 8.5217 16.1417) (layer "F.CrtYd") (width 0.05) (tstamp 402c62e6-8d8e-473a-a0cf-2b86e4908cd7))
    (fp_line (start 7.366 -2.4765) (end 7.366 -0.9017) (layer "F.CrtYd") (width 0.05) (tstamp 5bab6a37-1fdf-4cf8-b571-44c962ed86e9))
    (fp_line (start -0.9017 -0.9017) (end -0.9017 16.1417) (layer "F.CrtYd") (width 0.05) (tstamp 645bdbdc-8f65-42ef-a021-2d3e7d74a739))
    (fp_line (start 7.366 16.1417) (end 7.366 17.7165) (layer "F.CrtYd") (width 0.05) (tstamp 706c1cb9-5d96-4282-9efc-6147f0125147))
    (fp_line (start 0.254 17.7165) (end 0.254 16.1417) (layer "F.CrtYd") (width 0.05) (tstamp 88deea08-baa5-4041-beb7-01c299cf00e6))
    (fp_line (start 0.254 17.7165) (end 7.366 17.7165) (layer "F.CrtYd") (width 0.05) (tstamp 8b963561-586b-4575-b721-87e7914602c6))
    (fp_line (start 0.254 -2.4765) (end 7.366 -2.4765) (layer "F.CrtYd") (width 0.05) (tstamp 92f063a3-7cce-4a96-8a3a-cf5767f700c6))
    (fp_line (start -0.9017 16.1417) (end -0.9017 -0.9017) (layer "F.CrtYd") (width 0.05) (tstamp 968a6172-7a4e-40ab-a78a-e4d03671e136))
    (fp_line (start 0.254 16.1417) (end -0.9017 16.1417) (layer "F.CrtYd") (width 0.05) (tstamp a177c3b4-b04c-490e-b3fe-d3d4d7aa24a7))
    (fp_line (start 0.254 -0.9017) (end 0.254 -2.4765) (layer "F.CrtYd") (width 0.05) (tstamp ad4d05f5-6957-42f8-b65c-c657b9a26485))
    (fp_line (start -0.9017 16.1417) (end 0.254 16.1417) (layer "F.CrtYd") (width 0.05) (tstamp b1ba92d5-0d41-4be9-b483-47d08dc1785d))
    (fp_line (start 7.366 16.1417) (end 8.5217 16.1417) (layer "F.CrtYd") (width 0.05) (tstamp b8c8c7a1-d546-4878-9de9-463ec76dff98))
    (fp_line (start 0.254 16.1417) (end 0.254 17.7165) (layer "F.CrtYd") (width 0.05) (tstamp bf6104a1-a529-4c00-b4ae-92001543f7ec))
    (fp_line (start 8.5217 -0.9017) (end 7.366 -0.9017) (layer "F.CrtYd") (width 0.05) (tstamp c1b11207-7c0a-49b3-a41d-2fe677d5f3b8))
    (fp_line (start 7.366 17.7165) (end 7.366 16.1417) (layer "F.CrtYd") (width 0.05) (tstamp da862bae-4511-4bb9-b18d-fa60a2737feb))
    (fp_line (start 7.366 17.7165) (end 0.254 17.7165) (layer "F.CrtYd") (width 0.05) (tstamp eb391a95-1c1d-4613-b508-c76b8bc13a73))
    (fp_line (start 8.5217 16.1417) (end 8.5217 -0.9017) (layer "F.CrtYd") (width 0.05) (tstamp ef94502b-f22d-4da7-a17f-4100090b03a1))
    (fp_line (start 0.254 -0.9017) (end -0.9017 -0.9017) (layer "F.CrtYd") (width 0.05) (tstamp f503ea07-bcf1-4924-930a-6f7e9cd312f8))
    (fp_line (start 0.254 -2.4765) (end 0.254 -0.9017) (layer "F.CrtYd") (width 0.05) (tstamp f67bbef3-6f59-49ba-8890-d1f9dc9f9ad6))
    (fp_line (start 7.366 -2.4765) (end 0.254 -2.4765) (layer "F.CrtYd") (width 0.05) (tstamp fe6d9604-2924-4f38-950b-a31e8a281973))
    (fp_line (start 8.0137 15.6337) (end 8.0137 14.8463) (layer "F.Fab") (width 0.1) (tstamp 022502e0-e724-4b75-bc35-3c5984dbeb76))
    (fp_line (start 8.0137 5.4737) (end 8.0137 4.6863) (layer "F.Fab") (width 0.1) (tstamp 06665bf8-cef1-4e75-8d5b-1537b3c1b090))
    (fp_line (start -0.3937 15.6337) (end 0.508 15.6337) (layer "F.Fab") (width 0.1) (tstamp 08ec951f-e7eb-41cf-9589-697107a98e88))
    (fp_line (start 0.508 15.6337) (end 0.508 14.8463) (layer "F.Fab") (width 0.1) (tstamp 09bbea88-8bd7-48ec-baae-1b4a9a11a40e))
    (fp_line (start 7.112 10.5537) (end 8.0137 10.5537) (layer "F.Fab") (width 0.1) (tstamp 0e32af77-726b-4e11-9f99-2e2484ba9e9b))
    (fp_line (start -0.3937 10.5537) (end 0.508 10.5537) (layer "F.Fab") (width 0.1) (tstamp 0f0f7bb5-ade7-4a81-82b4-43be6a8ad05c))
    (fp_line (start -0.3937 14.8463) (end -0.3937 15.6337) (layer "F.Fab") (width 0.1) (tstamp 0fb27e11-fde6-4a25-adbb-e9684771b369))
    (fp_line (start 0.508 -0.3937) (end -0.3937 -0.3937) (layer "F.Fab") (width 0.1) (tstamp 113ffcdf-4c54-4e37-81dc-f91efa934ba7))
    (fp_line (start 8.0137 7.2263) (end 7.112 7.2263) (layer "F.Fab") (width 0.1) (tstamp 15189cef-9045-423b-b4f6-a763d4e75704))
    (fp_line (start 8.0137 9.7663) (end 7.112 9.7663) (layer "F.Fab") (width 0.1) (tstamp 152cd84e-bbed-4df5-a866-d1ab977b0966))
    (fp_line (start -0.3937 8.0137) (end 0.508 8.0137) (layer "F.Fab") (width 0.1) (tstamp 162e5bdd-61a8-46a3-8485-826b5d58e1a1))
    (fp_line (start 7.112 2.9337) (end 8.0137 2.9337) (layer "F.Fab") (width 0.1) (tstamp 178ae27e-edb9-4ffb-bd13-c0a6dd659606))
    (fp_line (start 7.112 0.3937) (end 8.0137 0.3937) (layer "F.Fab") (width 0.1) (tstamp 1a22eb2d-f625-4371-a918-ff1b97dc8219))
    (fp_line (start -0.3937 0.3937) (end 0.508 0.3937) (layer "F.Fab") (width 0.1) (tstamp 2102c637-9f11-48f1-aae6-b4139dc22be2))
    (fp_line (start 0.508 2.1463) (end -0.3937 2.1463) (layer "F.Fab") (width 0.1) (tstamp 272c2a78-b5f5-4b61-aed3-ec69e0e92729))
    (fp_line (start 0.508 -2.2225) (end 0.508 17.4625) (layer "F.Fab") (width 0.1) (tstamp 291935ec-f8ff-41f0-8717-e68b8af7b8c1))
    (fp_line (start 7.112 8.0137) (end 8.0137 8.0137) (layer "F.Fab") (width 0.1) (tstamp 2a4111b7-8149-4814-9344-3b8119cd75e4))
    (fp_line (start 0.508 8.0137) (end 0.508 7.2263) (layer "F.Fab") (width 0.1) (tstamp 2b25e886-ded1-450a-ada1-ece4208052e4))
    (fp_line (start 7.112 9.7663) (end 7.112 10.5537) (layer "F.Fab") (width 0.1) (tstamp 2ee28fa9-d785-45a1-9a1b-1be02ad8cd0b))
    (fp_line (start 7.112 14.8463) (end 7.112 15.6337) (layer "F.Fab") (width 0.1) (tstamp 2eea20e6-112c-411a-b615-885ae773135a))
    (fp_line (start 0.508 9.7663) (end -0.3937 9.7663) (layer "F.Fab") (width 0.1) (tstamp 2f3fba7a-cf45-4bd8-9035-07e6fa0b4732))
    (fp_line (start 0.508 10.5537) (end 0.508 9.7663) (layer "F.Fab") (width 0.1) (tstamp 319c683d-aed6-4e7d-aee2-ff9871746d52))
    (fp_line (start 7.112 17.4625) (end 7.112 -2.2225) (layer "F.Fab") (width 0.1) (tstamp 35fb7c56-dc85-43f7-b954-81b8040a8500))
    (fp_line (start 0.508 2.9337) (end 0.508 2.1463) (layer "F.Fab") (width 0.1) (tstamp 3f2a6679-91d7-4b6c-bf5c-c4d5abb2bc44))
    (fp_line (start 0.508 14.8463) (end -0.3937 14.8463) (layer "F.Fab") (width 0.1) (tstamp 41c18011-40db-4384-9ba4-c0158d0d9d6a))
    (fp_line (start 0.508 12.3063) (end -0.3937 12.3063) (layer "F.Fab") (width 0.1) (tstamp 4346fe55-f906-453a-b81a-1c013104a598))
    (fp_line (start -0.3937 7.2263) (end -0.3937 8.0137) (layer "F.Fab") (width 0.1) (tstamp 456c5e47-d71e-4708-b061-1e61634d8648))
    (fp_line (start 7.112 15.6337) (end 8.0137 15.6337) (layer "F.Fab") (width 0.1) (tstamp 49fec31e-3712-4229-8142-b191d90a97d0))
    (fp_line (start 0.508 17.4625) (end 7.112 17.4625) (layer "F.Fab") (width 0.1) (tstamp 4e677390-a246-4ca0-954c-746e0870f88f))
    (fp_line (start 7.112 7.2263) (end 7.112 8.0137) (layer "F.Fab") (width 0.1) (tstamp 560d05a7-84e4-403a-80d1-f287a4032b8a))
    (fp_line (start -0.3937 13.0937) (end 0.508 13.0937) (layer "F.Fab") (width 0.1) (tstamp 56d2bc5d-fd72-4542-ab0f-053a5fd60efa))
    (fp_line (start 0.508 13.0937) (end 0.508 12.3063) (layer "F.Fab") (width 0.1) (tstamp 5e6153e6-2c19-46de-9a8e-b310a2a07861))
    (fp_line (start 0.508 5.4737) (end 0.508 4.6863) (layer "F.Fab") (width 0.1) (tstamp 62f15a9a-9893-486e-9ad0-ea43f88fc9e7))
    (fp_line (start 8.0137 13.0937) (end 8.0137 12.3063) (layer "F.Fab") (width 0.1) (tstamp 66ca01b3-51ff-4294-9b77-4492e98f6aec))
    (fp_line (start 7.112 -0.3937) (end 7.112 0.3937) (layer "F.Fab") (width 0.1) (tstamp 6ff9bb63-d6fd-4e32-bb60-7ac65509c2e9))
    (fp_line (start -0.3937 2.9337) (end 0.508 2.9337) (layer "F.Fab") (width 0.1) (tstamp 7273dd21-e834-41d3-b279-d7de727709ca))
    (fp_line (start 7.112 -2.2225) (end 0.508 -2.2225) (layer "F.Fab") (width 0.1) (tstamp 73ee7e03-97a8-4121-b568-c25f3934a935))
    (fp_line (start 8.0137 10.5537) (end 8.0137 9.7663) (layer "F.Fab") (width 0.1) (tstamp 8a427111-6480-4b0c-b097-d8b6a0ee1819))
    (fp_line (start 7.112 12.3063) (end 7.112 13.0937) (layer "F.Fab") (width 0.1) (tstamp 9f969b13-1795-4747-8326-93bdc304ed56))
    (fp_line (start 8.0137 4.6863) (end 7.112 4.6863) (layer "F.Fab") (width 0.1) (tstamp 9fdca5c2-1fbd-4774-a9c3-8795a40c206d))
    (fp_line (start 7.112 2.1463) (end 7.112 2.9337) (layer "F.Fab") (width 0.1) (tstamp a0d52767-051a-423c-a600-928281f27952))
    (fp_line (start 7.112 4.6863) (end 7.112 5.4737) (layer "F.Fab") (width 0.1) (tstamp a239fd1d-dfbb-49fd-b565-8c3de9dcf42b))
    (fp_line (start -0.3937 2.1463) (end -0.3937 2.9337) (layer "F.Fab") (width 0.1) (tstamp a3fab380-991d-404b-95d5-1c209b047b6e))
    (fp_line (start 8.0137 8.0137) (end 8.0137 7.2263) (layer "F.Fab") (width 0.1) (tstamp a686ed7c-c2d1-4d29-9d54-727faf9fd6bf))
    (fp_line (start 8.0137 2.9337) (end 8.0137 2.1463) (layer "F.Fab") (width 0.1) (tstamp aa8663be-9516-4b07-84d2-4c4d668b8596))
    (fp_line (start 0.508 4.6863) (end -0.3937 4.6863) (layer "F.Fab") (width 0.1) (tstamp b2b363dd-8e47-4a76-a142-e00e28334875))
    (fp_line (start 7.112 13.0937) (end 8.0137 13.0937) (layer "F.Fab") (width 0.1) (tstamp b9d4de74-d246-495d-8b63-12ab2133d6d6))
    (fp_line (start -0.3937 4.6863) (end -0.3937 5.4737) (layer "F.Fab") (width 0.1) (tstamp c15b2f75-2e10-4b71-bebb-e2b872171b92))
    (fp_line (start -0.3937 12.3063) (end -0.3937 13.0937) (layer "F.Fab") (width 0.1) (tstamp c512fed3-9770-476b-b048-e781b4f3cd72))
    (fp_line (start -0.3937 -0.3937) (end -0.3937 0.3937) (layer "F.Fab") (width 0.1) (tstamp c7cd39db-931a-4d86-96b8-57e6b39f58f9))
    (fp_line (start -0.3937 9.7663) (end -0.3937 10.5537) (layer "F.Fab") (width 0.1) (tstamp cb1a49ef-0a06-4f40-9008-61d1d1c36198))
    (fp_line (start 0.508 0.3937) (end 0.508 -0.3937) (layer "F.Fab") (width 0.1) (tstamp ceb12634-32ca-4cbf-9ff5-5e8b53ab18ad))
    (fp_line (start 7.112 5.4737) (end 8.0137 5.4737) (layer "F.Fab") (width 0.1) (tstamp d32956af-146b-4a09-a053-d9d64b8dd86d))
    (fp_line (start 8.0137 14.8463) (end 7.112 14.8463) (layer "F.Fab") (width 0.1) (tstamp d655bb0a-cbf9-4908-ad60-7024ff468fbd))
    (fp_line (start 8.0137 -0.3937) (end 7.112 -0.3937) (layer "F.Fab") (width 0.1) (tstamp d767f2ff-12ec-4778-96cb-3fdd7a473d60))
    (fp_line (start 8.0137 2.1463) (end 7.112 2.1463) (layer "F.Fab") (width 0.1) (tstamp dfcef016-1bf5-4158-8a79-72d38a522877))
    (fp_line (start 8.0137 0.3937) (end 8.0137 -0.3937) (layer "F.Fab") (width 0.1) (tstamp f674b8e7-203d-419e-988a-58e0f9ae4fad))
    (fp_line (start -0.3937 5.4737) (end 0.508 5.4737) (layer "F.Fab") (width 0.1) (tstamp f6a5c856-f2b5-40eb-a958-b666a0d408a0))
    (fp_line (start 8.0137 12.3063) (end 7.112 12.3063) (layer "F.Fab") (width 0.1) (tstamp fb0bf2a0-d317-42f7-b022-b5e05481f6be))
    (fp_line (start 0.508 7.2263) (end -0.3937 7.2263) (layer "F.Fab") (width 0.1) (tstamp ffa442c7-cbef-461f-8613-c211201cec06))
    (fp_arc (start 7.530968 -4.388548) (mid 5.976048 1.498468) (end 0.089032 -0.056452) (layer "F.Fab") (width 0.1) (tstamp 82204892-ec79-4d38-a593-52fb9a9b4b87))
    (pad "1" thru_hole rect locked (at 0 0 270) (size 1.2954 1.2954) (drill 0.7874) (layers *.Cu *.Mask)
      (net 17 "Net-(U1-Pad16)") (pinfunction "1A") (pintype "input") (tstamp 4cfd9a02-97ef-4af4-a6b8-db9be1a8fda5))
    (pad "2" thru_hole circle locked (at 0 2.54 270) (size 1.2954 1.2954) (drill 0.7874) (layers *.Cu *.Mask)
      (net 3 "GNDREF") (pinfunction "1B") (pintype "input") (tstamp aadc3df5-0e2d-4f3d-b72e-6f184da74c89))
    (pad "3" thru_hole circle locked (at 0 5.08 270) (size 1.2954 1.2954) (drill 0.7874) (layers *.Cu *.Mask)
      (net 53 "Net-(R1-Pad2)") (pinfunction "1Y") (pintype "output") (tstamp 92761c09-a591-4c8e-af4d-e0e2262cb01d))
    (pad "4" thru_hole circle locked (at 0 7.62 270) (size 1.2954 1.2954) (drill 0.7874) (layers *.Cu *.Mask)
      (net 41 "unconnected-(U2-Pad4)") (pinfunction "2A") (pintype "input") (tstamp 8a8c373f-9bc3-4cf7-8f41-4802da916698))
    (pad "5" thru_hole circle locked (at 0 10.16 270) (size 1.2954 1.2954) (drill 0.7874) (layers *.Cu *.Mask)
      (net 42 "unconnected-(U2-Pad5)") (pinfunction "2B") (pintype "input") (tstamp 749d9ed0-2ff2-4b55-abc5-f7231ec3aa28))
    (pad "6" thru_hole circle locked (at 0 12.7 270) (size 1.2954 1.2954) (drill 0.7874) (layers *.Cu *.Mask)
      (net 43 "unconnected-(U2-Pad6)") (pinfunction "2Y") (pintype "output") (tstamp 54ed3ee1-891b-418e-ab9c-6a18747d7388))
    (pad "7" thru_hole circle locked (at 0 15.24 270) (size 1.2954 1.2954) (drill 0.7874) (layers *.Cu *.Mask)
      (net 3 "GNDREF") (pinfunction "GND") (pintype "power_in") (tstamp fd60415a-f01a-46c5-9369-ea970e435e5b))
    (pad "8" thru_hole circle locked (at 7.62 15.24 270) (size 1.2954 1.2954) (drill 0.7874) (layers *.Cu *.Mask)
      (net 44 "unconnected-(U2-Pad8)") (pinfunction "3Y") (pintype "output") (tstamp af76ce95-feca-41fb-bf31-edaa26d6766a))
    (pad "9" thru_hole circle locked (at 7.62 12.7 270) (size 1.2954 1.2954) (drill 0.7874) (layers *.Cu *.Mask)
      (net 45 "unconnected-(U2-Pad9)") (pinfunction "3A") (pintype "input") (tstamp e11ae5a5-aa10-4f10-b346-f16e33c7899a))
    (pad "10" thru_hole circle locked (at 7.62 10.16 270) (size 1.2954 1.2954) (drill 0.7874) (layers *.Cu *.Mask)
      (net 46 "unconnected-(U2-Pad10)") (pinfunction "3B") (pintype "input") (tstamp f23ac723-a36d-491d-9473-7ec0ffed332d))
    (pad "11" thru_hole circle locked (at 7.62 7.62 270) (size 1.2954 1.2954) (drill 0.7874) (layers *.Cu *.Mask)
      (net 47 "unconnected-(U2-Pad11)") (pinfunction "4Y") (pintype "output") (tstamp 4bbde53d-6894-4e18-9480-84a6a26d5f6b))
    (pad "12" thru_hole circle locked (at 7.62 5.08 270) (size 1.2954 1.2954) (drill 0.7874) (layers *.Cu *.Mask)
      (net 48 "unconnected-(U2-Pad12)") (pinfunction "4A") (pintype "input") (tstamp d3dd7cdb-b730-487d-804d-99150ba318ef))
    (pad "13" thru_hole circle locked (at 7.62 2.54 270) (size 1.2954 1.2954) (drill 0.7874) (layers *.Cu *.Mask)
      (net 49 "unconnected-(U2-Pad13)") (pinfunction "4B") (pintype "input") (tstamp c3d5daf8-d359-42b2-a7c2-0d080ba7e212))
    (pad "14" thru_hole circle locked (at 7.62 0 270) (size 1.2954 1.2954) (drill 0.7874) (layers *.Cu *.Mask)
      (net 1 "+5V") (pinfunction "VCC") (pintype "power_in") (tstamp 9112ddd5-10d5-48b8-954f-f1d5adcacbd9))
  )

  (footprint "RPI Pico:RPi_Pico_SMD_TH_MINIMAL" (layer "F.Cu")
    (tedit 5F638C80) (tstamp 99ebe0dd-01b1-4cf2-b69b-0c186d9de8d3)
    (at 62.352588 54.571296)
    (descr "Through hole straight pin header, 2x20, 2.54mm pitch, double rows")
    (tags "Through hole pin header THT 2x20 2.54mm double row")
    (property "Sheetfile" "wordclock.kicad_sch")
    (property "Sheetname" "")
    (path "/b35b53c6-60a2-4866-8417-3602698632af")
    (attr through_hole)
    (fp_text reference "U1" (at 0 0) (layer "F.SilkS")
      (effects (font (size 1 1) (thickness 0.15)))
      (tstamp 6bf894f9-43c2-4653-b73b-148d5b5a9eca)
    )
    (fp_text value "Pico W" (at 0 2.159) (layer "F.Fab")
      (effects (font (size 1 1) (thickness 0.15)))
      (tstamp b5969789-f675-41e8-a4df-8b0b8a8e4ee2)
    )
    (fp_text user "GP10" (at -5.619047 8.89) (layer "F.SilkS")
      (effects (font (size 0.8 0.8) (thickness 0.15)))
      (tstamp 1092520c-2c0f-4028-9842-8e3dbcd0d16a)
    )
    (fp_text user "GP9" (at -6 3.81) (layer "F.SilkS")
      (effects (font (size 0.8 0.8) (thickness 0.15)))
      (tstamp 11178639-4b70-457c-8c6d-25e2a198477c)
    )
    (fp_text user "GP27" (at 5.729253 -3.804694) (layer "F.SilkS")
      (effects (font (size 0.8 0.8) (thickness 0.15)))
      (tstamp 1255d7c9-756c-4d85-b0e6-13a720acdea6)
    )
    (fp_text user "GND" (at -5.961905 19.05) (layer "F.SilkS")
      (effects (font (size 0.8 0.8) (thickness 0.15)))
      (tstamp 1e8d3939-65c9-4313-b9e1-3765a3ba7f79)
    )
    (fp_text user "GP4" (at -6 -11.43) (layer "F.SilkS")
      (effects (font (size 0.8 0.8) (thickness 0.15)))
      (tstamp 225e368d-e823-448f-84f2-442d43244a34)
    )
    (fp_text user "GP2" (at -6 -16.51) (layer "F.SilkS")
      (effects (font (size 0.8 0.8) (thickness 0.15)))
      (tstamp 25ae536c-30ba-4f16-a69e-9a359f745311)
    )
    (fp_text user "GP3" (at -6 -13.97) (layer "F.SilkS")
      (effects (font (size 0.8 0.8) (thickness 0.15)))
      (tstamp 2a57f5d7-a323-407b-bea4-1b5f2ab78b93)
    )
    (fp_text user "SWDIO" (at 2.590005 20.911666 90) (layer "F.SilkS")
      (effects (font (size 0.8 0.8) (thickness 0.15)))
      (tstamp 2f827d8c-4b68-4e64-aa7f-0f1d9e02acb6)
    )
    (fp_text user "GND" (at 6.07211 -18.919893) (layer "F.SilkS")
      (effects (font (size 0.8 0.8) (thickness 0.15)))
      (tstamp 39a9a079-955b-4881-99e6-51958e3bdea7)
    )
    (fp_text user "GP17" (at 5.729253 21.585306) (layer "F.SilkS")
      (effects (font (size 0.8 0.8) (thickness 0.15)))
      (tstamp 4269d5cc-5e3e-4a5c-9d00-7800b3ba4560)
    )
    (fp_text user "GP16" (at 5.729253 24.125306) (layer "F.SilkS")
      (effects (font (size 0.8 0.8) (thickness 0.15)))
      (tstamp 48b8d3f0-47ba-48c8-94b7-bb150e47ec2e)
    )
    (fp_text user "GP6" (at -6 -3.81) (layer "F.SilkS")
      (effects (font (size 0.8 0.8) (thickness 0.15)))
      (tstamp 4fe04c5e-8476-4135-bb9a-0b0bb7a270a2)
    )
    (fp_text user "GP5" (at -6 -8.89) (layer "F.SilkS")
      (effects (font (size 0.8 0.8) (thickness 0.15)))
      (tstamp 645b7c0c-09f8-438d-aaa7-77480f110f98)
    )
    (fp_text user "SWCLK" (at -2.533346 20.734999 90) (layer "F.SilkS")
      (effects (font (size 0.8 0.8) (thickness 0.15)))
      (tstamp 6ccadba5-f99a-470e-bbb4-f35471e5b16e)
    )
    (fp_text user "GP15" (at -5.619047 24.13) (layer "F.SilkS")
      (effects (font (size 0.8 0.8) (thickness 0.15)))
      (tstamp 6e3fef4d-385f-4417-afca-2223880e2c2d)
    )
    (fp_text user "GND" (at -5.961905 6.35) (layer "F.SilkS")
      (effects (font (size 0.8 0.8) (thickness 0.15)))
      (tstamp 77233e0e-74ab-47a5-8260-6a2b4c217e08)
    )
    (fp_text user "VBUS" (at 5.748301 -24.004694) (layer "F.SilkS")
      (effects (font (size 0.8 0.8) (thickness 0.15)))
      (tstamp 78be3e19-210b-4708-821d-693df0657078)
    )
    (fp_text user "GP14" (at -5.619047 21.59) (layer "F.SilkS")
      (effects (font (size 0.8 0.8) (thickness 0.15)))
      (tstamp 7db3f2b2-6695-4f40-917b-e82f4e76b3b8)
    )
    (fp_text user "GP22" (at 5.729253 3.805306) (layer "F.SilkS")
      (effects (font (size 0.8 0.8) (thickness 0.15)))
      (tstamp 8e89bcaf-bf3d-43be-b4b5-c1df4bb1fcdc)
    )
    (fp_text user "GP11" (at -5.619047 11.43) (layer "F.SilkS")
      (effects (font (size 0.8 0.8) (thickness 0.15)))
      (tstamp 93782ff8-57b7-4199-80d6-d24f2e58001e)
    )
    (fp_text user "GP13" (at -5.619047 16.51) (layer "F.SilkS")
      (effects (font (size 0.8 0.8) (thickness 0.15)))
      (tstamp 964a53ef-22a6-4d2c-af9d-5ecb6249176a)
    )
    (fp_text user "GP18" (at 5.729253 16.505306) (layer "F.SilkS")
      (effects (font (size 0.8 0.8) (thickness 0.15)))
      (tstamp 972ba65f-734e-4f0b-8c42-5b36c5a2b4b0)
    )
    (fp_text user "ADC_VREF" (at 4.39592 -11.393866) (layer "F.SilkS")
      (effects (font (size 0.8 0.8) (thickness 0.15)))
      (tstamp a6b17000-f7d4-451a-b1b4-de3735c80a0a)
    )
    (fp_text user "VSYS" (at 5.843539 -21.594694) (layer "F.SilkS")
      (effects (font (size 0.8 0.8) (thickness 0.15)))
      (tstamp ac8ec556-f0c0-4ccc-a993-c4014e2b3536)
    )
    (fp_text user "GP21" (at 5.729253 8.895306) (layer "F.SilkS")
      (effects (font (size 0.8 0.8) (thickness 0.15)))
      (tstamp b0af62a1-2ec4-42dd-94ac-fefeb916fc43)
    )
    (fp_text user "RUN" (at 6.053063 1.265306) (layer "F.SilkS")
      (effects (font (size 0.8 0.8) (thickness 0.15)))
      (tstamp b166d854-f865-4e61-9bba-e340da732546)
    )
    (fp_text user "3V3" (at 6.186396 -13.937875) (layer "F.SilkS")
      (effects (font (size 0.8 0.8) (thickness 0.15)))
      (tstamp b6feb889-f686-4ab3-a1d6-e3036201996f)
    )
    (fp_text user "3V3_EN" (at 5.100682 -16.460684) (layer "F.SilkS")
      (effects (font (size 0.8 0.8) (thickness 0.15)))
      (tstamp b8343af5-d53f-4ee1-b83c-4b4df8367b8a)
    )
    (fp_text user "GP0" (at -6 -24.13) (layer "F.SilkS")
      (effects (font (size 0.8 0.8) (thickness 0.15)))
      (tstamp bab05f03-bb32-4924-a247-cbe3b253a9be)
    )
    (fp_text user "GP8" (at -6 1.27) (layer "F.SilkS")
      (effects (font (size 0.8 0.8) (thickness 0.15)))
      (tstamp be24d6eb-fec3-4089-9f4e-ebed5196c106)
    )
    (fp_text user "GP7" (at -6 -1.3) (layer "F.SilkS")
      (effects (font (size 0.8 0.8) (thickness 0.15)))
      (tstamp c579bc40-dd00-47ac-92fc-752b7c9c2453)
    )
    (fp_text user "AGND" (at 5.729253 -6.354694) (layer "F.SilkS")
      (effects (font (size 0.8 0.8) (thickness 0.15)))
      (tstamp c802debb-3695-4bf1-a1b5-7dbae6634bb7)
    )
    (fp_text user "GND" (at -5.961905 -19.05) (layer "F.SilkS")
      (effects (font (size 0.8 0.8) (thickness 0.15)))
      (tstamp cb3c295f-19c5-40f2-83e0-8031dcb8643d)
    )
    (fp_text user "GND" (at 6.07211 6.345306) (layer "F.SilkS")
      (effects (font (size 0.8 0.8) (thickness 0.15)))
      (tstamp d9951181-e886-4a71-9141-9046dd22f879)
    )
    (fp_text user "GP1" (at -6 -21.6 180) (layer "F.SilkS")
      (effects (font (size 0.8 0.8) (thickness 0.15)))
      (tstamp e1110524-9d88-4fa9-afec-1859834e2f21)
    )
    (fp_text user "GP12" (at -5.619047 13.97) (layer "F.SilkS")
      (effects (font (size 0.8 0.8) (thickness 0.15)))
      (tstamp e1fca7e7-fe98-4952-b375-781368ae20aa)
    )
    (fp_text user "GND" (at 6.07211 19.045306) (layer "F.SilkS")
      (effects (font (size 0.8 0.8) (thickness 0.15)))
      (tstamp e28a762f-d0fa-47e0-b3a8-ae06b72614e9)
    )
    (fp_text user "GP20" (at 5.729253 11.425306) (layer "F.SilkS")
      (effects (font (size 0.8 0.8) (thickness 0.15)))
      (tstamp e3dbfbb0-ad3a-4e1f-8dbb-e9f0f2fb50be)
    )
    (fp_text user "GP26" (at 5.729253 -1.274694) (layer "F.SilkS")
      (effects (font (size 0.8 0.8) (thickness 0.15)))
      (tstamp f04cc288-ac50-4f44-ae97-466a51837c6e)
    )
    (fp_text user "GP28" (at 5.729253 -8.743856) (layer "F.SilkS")
      (effects (font (size 0.8 0.8) (thickness 0.15)))
      (tstamp f1ba32ba-a7eb-4bfe-b73f-549f64260c68)
    )
    (fp_text user "GP19" (at 5.729253 13.965306) (layer "F.SilkS")
      (effects (font (size 0.8 0.8) (thickness 0.15)))
      (tstamp f2aabb10-8359-426a-89a0-6a57ac0b8fc2)
    )
    (fp_text user "GND" (at -5.961905 -6.35) (layer "F.SilkS")
      (effects (font (size 0.8 0.8) (thickness 0.15)))
      (tstamp f6b699e5-6513-485b-812f-af50c6057802)
    )
    (fp_text user "${REFERENCE}" (at 0 0 180) (layer "F.Fab")
      (effects (font (size 1 1) (thickness 0.15)))
      (tstamp fb4ec8c3-d2ba-4618-aa70-8c7e2404430c)
    )
    (fp_line (start -10.5 7.4) (end -10.5 7.8) (layer "F.SilkS") (width 0.12) (tstamp 0832dd2a-9d05-4cf1-9d68-d119d1d5717e))
    (fp_line (start -10.5 4.9) (end -10.5 5.3) (layer "F.SilkS") (width 0.12) (tstamp 0c0115f8-dc0e-4a26-8067-6cdd8fe69ceb))
    (fp_line (start -10.5 -15.4) (end -10.5 -15) (layer "F.SilkS") (width 0.12) (tstamp 0d1978cb-757e-4f94-83f1-7b655957d62a))
    (fp_line (start -10.5 -10.4) (end -10.5 -10) (layer "F.SilkS") (width 0.12) (tstamp 0e9f7746-9324-494d-ba80-336c8202fb53))
    (fp_line (start -10.5 -5.3) (end -10.5 -4.9) (layer "F.SilkS") (width 0.12) (tstamp 11ded91b-59c6-4b6a-a2a9-7d3ba5d38276))
    (fp_line (start 10.5 -2.7) (end 10.5 -2.3) (layer "F.SilkS") (width 0.12) (tstamp 2246dadd-ff1e-42e2-ae32-da66eb7af9fb))
    (fp_line (start 10.5 -23.1) (end 10.5 -22.7) (layer "F.SilkS") (width 0.12) (tstamp 23ef0fac-71b1-4f54-a7e7-0691d7535249))
    (fp_line (start -3.7 25.5) (end -10.5 25.5) (layer "F.SilkS") (width 0.12) (tstamp 2540bcf6-ad20-4895-8daf-f0243a3583be))
    (fp_line (start 10.5 -7.8) (end 10.5 -7.4) (layer "F.SilkS") (width 0.12) (tstamp 2ddace1e-bd31-46dd-a209-ef1a0d0f9725))
    (fp_line (start 10.5 -25.5) (end 10.5 -25.2) (layer "F.SilkS") (width 0.12) (tstamp 3355c8ff-9bfa-4258-bbe5-2cca25bcb7c2))
    (fp_line (start -10.5 -18) (end -10.5 -17.6) (layer "F.SilkS") (width 0.12) (tstamp 360a06d8-b0bb-4580-a3b4-7ccbf83fc368))
    (fp_line (start 10.5 20.1) (end 10.5 20.5) (layer "F.SilkS") (width 0.12) (tstamp 3a1f67b4-7aeb-460b-8ce3-e84a14decaea))
    (fp_line (start -10.5 15.1) (end -10.5 15.5) (layer "F.SilkS") (width 0.12) (tstamp 3dcb82af-5522-4234-9097-cffd473db105))
    (fp_line (start -10.5 -7.8) (end -10.5 -7.4) (layer "F.SilkS") (width 0.12) (tstamp 50a470d3-b2a0-4451-b0b1-f79ba7afe543))
    (fp_line (start 10.5 25.5) (end 3.7 25.5) (layer "F.SilkS") (width 0.12) (tstamp 5b8359f8-700c-4aba-8a17-3ae0fdd76efc))
    (fp_line (start -10.5 20.1) (end -10.5 20.5) (layer "F.SilkS") (width 0.12) (tstamp 66454e14-b51b-4c0d-8dcc-a9a0c61a9cea))
    (fp_line (start 1.1 25.5) (end 1.5 25.5) (layer "F.SilkS") (width 0.12) (tstamp 676e29fb-f263-4f51-b9c1-419c2195a706))
    (fp_line (start -1.5 25.5) (end -1.1 25.5) (layer "F.SilkS") (width 0.12) (tstamp 705cc7b6-5294-4071-835a-60fe683395b1))
    (fp_line (start 10.5 17.6) (end 10.5 18) (layer "F.SilkS") (width 0.12) (tstamp 70f86704-7162-4d81-af00-44a1d7c0ec65))
    (fp_line (start 10.5 12.5) (end 10.5 12.9) (layer "F.SilkS") (width 0.12) (tstamp 74bb1af9-afce-406a-b170-b659695fc659))
    (fp_line (start -10.5 10) (end -10.5 10.4) (layer "F.SilkS") (width 0.12) (tstamp 8630b84c-977d-46f6-b361-9f09f17539a8))
    (fp_line (start 10.5 -12.9) (end 10.5 -12.5) (layer "F.SilkS") (width 0.12) (tstamp 88f94af6-0ccf-42db-9536-8480230b9ddf))
    (fp_line (start -10.5 -2.7) (end -10.5 -2.3) (layer "F.SilkS") (width 0.12) (tstamp 89a74190-e919-45ff-a761-1d3f12aa4ccc))
    (fp_line (start -10.5 -22.833) (end -7.493 -22.833) (layer "F.SilkS") (width 0.12) (tstamp 8c8f55af-2e94-40ba-9c5b-06840fc0a459))
    (fp_line (start -10.5 2.3) (end -10.5 2.7) (layer "F.SilkS") (width 0.12) (tstamp 9106ede1-a95b-4bdc-a20d-fc9b1eaefb36))
    (fp_line (start 10.5 -18) (end 10.5 -17.6) (layer "F.SilkS") (width 0.12) (tstamp 997ffa04-7c2c-4c4a-b619-e68cc7f7c7f8))
    (fp_line (start -10.5 17.6) (end -10.5 18) (layer "F.SilkS") (width 0.12) (tstamp 9a163016-be67-4d22-bfb8-96ad8bef0b86))
    (fp_line (start 10.5 2.3) (end 10.5 2.7) (layer "F.SilkS") (width 0.12) (tstamp 9d1ef6fd-6f67-4e97-87be-f7bbf4ac7873))
    (fp_line (start 10.5 7.4) (end 10.5 7.8) (layer "F.SilkS") (width 0.12) (tstamp 9d6192e5-9c24-498b-9e32-082d729f9dbc))
    (fp_line (start -10.5 -23.1) (end -10.5 -22.7) (layer "F.SilkS") (width 0.12) (tstamp a059d355-e119-470e-bd70-61a8af724110))
    (fp_line (start 10.5 22.7) (end 10.5 23.1) (layer "F.SilkS") (width 0.12) (tstamp a6add0e3-1114-45af-b649-48528dde7bfc))
    (fp_line (start -10.5 12.5) (end -10.5 12.9) (layer "F.SilkS") (width 0.12) (tstamp a796a5dc-3ef8-4a07-97cf-5cea8f7f86d8))
    (fp_line (start -10.5 -25.5) (end 10.5 -25.5) (layer "F.SilkS") (width 0.12) (tstamp abb0297c-ab02-4d6b-8068-38ab7c867fc3))
    (fp_line (start -10.5 -20.5) (end -10.5 -20.1) (layer "F.SilkS") (width 0.12) (tstamp ac92f54e-1f01-45c0-a9fe-65d53cf19b6a))
    (fp_line (start 10.5 -10.4) (end 10.5 -10) (layer "F.SilkS") (width 0.12) (tstamp b1be0754-374f-40ce-b793-e401e7c0ad2b))
    (fp_line (start -10.5 22.7) (end -10.5 23.1) (layer "F.SilkS") (width 0.12) (tstamp b57e71e6-7cea-437d-ac47-57c8c19ae03a))
    (fp_line (start 10.5 -5.3) (end 10.5 -4.9) (layer "F.SilkS") (width 0.12) (tstamp c8c3ba6e-6f6e-4a97-b351-bbff9b9bdcc2))
    (fp_line (start -7.195952 -22.833) (end -7.195952 -25.5) (layer "F.SilkS") (width 0.12) (tstamp c991b1e8-94bc-435e-848b-107af5f3d59e))
    (fp_line (start -10.5 -0.2) (end -10.5 0.2) (layer "F.SilkS") (width 0.12) (tstamp ccef706d-cba5-48fa-b799-e29cfe33b871))
    (fp_line (start 10.5 -0.2) (end 10.5 0.2) (layer "F.SilkS") (width 0.12) (tstamp cd601ef5-86b4-4d72-8285-c45b34e6472d))
    (fp_line (start 10.5 -15.4) (end 10.5 -15) (layer "F.SilkS") (width 0.12) (tstamp ce4d3726-bc60-401b-af92-03298927a4b6))
    (fp_line (start -10.5 -12.9) (end -10.5 -12.5) (layer "F.SilkS") (width 0.12) (tstamp cebf8591-e173-4695-867a-aeed2b9553d8))
    (fp_line (start 10.5 10) (end 10.5 10.4) (layer "F.SilkS") (width 0.12) (tstamp dc58bee5-9e00-4164-a527-ba00e9305944))
    (fp_line (start 10.5 4.9) (end 10.5 5.3) (layer "F.SilkS") (width 0.12) (tstamp dec16ed6-736d-4e5d-bf4a-30aab1ca8243))
    (fp_line (start -10.5 -25.5) (end -10.5 -25.2) (layer "F.SilkS") (width 0.12) (tstamp f22287c7-abf6-4f67-82c9-085b60db8b3e))
    (fp_line (start 10.5 -20.5) (end 10.5 -20.1) (layer "F.SilkS") (width 0.12) (tstamp f397aadd-05ce-4cf7-beb1-d83d38f41a4b))
    (fp_line (start 10.5 15.1) (end 10.5 15.5) (layer "F.SilkS") (width 0.12) (tstamp f3df332d-fa75-4b9a-a9ef-ae0cc23d7413))
    (fp_poly (pts
        (xy 3.7 -20.2)
        (xy -3.7 -20.2)
        (xy -3.7 -24.9)
        (xy 3.7 -24.9)
      ) (layer "Dwgs.User") (width 0.1) (fill solid) (tstamp 0b2174e3-f9de-46d3-980b-e9aed571e74f))
    (fp_poly (pts
        (xy -1.5 -11.5)
        (xy -3.5 -11.5)
        (xy -3.5 -13.5)
        (xy -1.5 -13.5)
      ) (layer "Dwgs.User") (width 0.1) (fill solid) (tstamp 27b1bb49-b4c6-4e7e-89c2-505374a72230))
    (fp_poly (pts
        (xy -1.5 -14)
        (xy -3.5 -14)
        (xy -3.5 -16)
        (xy -1.5 -16)
      ) (layer "Dwgs.User") (width 0.1) (fill solid) (tstamp 4b1bd639-9bd2-4b2a-91e9-50a4e9e50624))
    (fp_poly (pts
        (xy -1.5 -16.5)
        (xy -3.5 -16.5)
        (xy -3.5 -18.5)
        (xy -1.5 -18.5)
      ) (layer "Dwgs.User") (width 0.1) (fill solid) (tstamp f1677d40-fdbd-46f0-98b8-700b26d5c3d6))
    (fp_line (start 11 -26) (end 11 26) (layer "F.CrtYd") (width 0.12) (tstamp 3442be7d-9a88-4941-815e-f755340e2021))
    (fp_line (start 11 26) (end -11 26) (layer "F.CrtYd") (width 0.12) (tstamp 37e39ab1-645d-4fbf-ad6e-27cf1245ae52))
    (fp_line (start -11 26) (end -11 -26) (layer "F.CrtYd") (width 0.12) (tstamp 42b5ada7-c631-46de-b36f-8560977928b8))
    (fp_line (start -11 -26) (end 11 -26) (layer "F.CrtYd") (width 0.12) (tstamp cd2fbf7c-fe09-4fa5-b6e4-6954d958884e))
    (fp_line (start -10.5 -25.5) (end 10.5 -25.5) (layer "F.Fab") (width 0.12) (tstamp 15d3373b-4f1a-4faf-a914-d0739d254c5d))
    (fp_line (start 10.5 -25.5) (end 10.5 25.5) (layer "F.Fab") (width 0.12) (tstamp 3e4fd122-65d9-41e0-bedd-78acf5899a0b))
    (fp_line (start -10.5 -24.2) (end -9.2 -25.5) (layer "F.Fab") (width 0.12) (tstamp 4ee43568-0bf4-4afc-b899-1b82f2692b95))
    (fp_line (start -10.5 25.5) (end -10.5 -25.5) (layer "F.Fab") (width 0.12) (tstamp a657f9df-c499-479a-b605-bc42c6b04331))
    (fp_line (start 10.5 25.5) (end -10.5 25.5) (layer "F.Fab") (width 0.12) (tstamp cb9ac460-cdde-4985-989d-cccd60f15192))
    (pad "1" thru_hole oval (at -8.89 -24.13) (size 1.7 1.7) (drill 1.02) (layers *.Cu *.Mask)
      (net 4 "unconnected-(U1-Pad1)") (pinfunction "GPIO0") (pintype "bidirectional") (tstamp a64c5a76-a982-41b2-9706-f5e1455f077b))
    (pad "1" smd rect (at -8.89 -24.13) (size 2.96 1.7) (drill (offset -0.63 0)) (layers "F.Cu" "F.Mask")
      (net 4 "unconnected-(U1-Pad1)") (pinfunction "GPIO0") (pintype "bidirectional") (tstamp f2a33390-9fc2-43cd-9608-f4554c6c6533))
    (pad "2" smd rect (at -8.89 -21.59) (size 2.96 1.7) (drill (offset -0.63 0)) (layers "F.Cu" "F.Mask")
      (net 5 "unconnected-(U1-Pad2)") (pinfunction "GPIO1") (pintype "bidirectional") (tstamp 3ead0b98-6b7d-496b-a1be-677dfd788c22))
    (pad "2" thru_hole oval (at -8.89 -21.59) (size 1.7 1.7) (drill 1.02) (layers *.Cu *.Mask)
      (net 5 "unconnected-(U1-Pad2)") (pinfunction "GPIO1") (pintype "bidirectional") (tstamp 4d05a709-fa0b-4f59-87d6-3583d874dc09))
    (pad "3" smd rect (at -8.89 -19.05) (size 2.96 1.7) (drill (offset -0.63 0)) (layers "F.Cu" "F.Mask")
      (net 56 "unconnected-(U1-Pad3)") (pinfunction "GND") (pintype "power_in") (tstamp 64e854bd-d82a-4a95-bb38-711d0fe0a5bf))
    (pad "3" thru_hole rect (at -8.89 -19.05) (size 1.7 1.7) (drill 1.02) (layers *.Cu *.Mask)
      (net 56 "unconnected-(U1-Pad3)") (pinfunction "GND") (pintype "power_in") (tstamp bdbc09ac-56d6-4fed-8536-b1fc98e1f464))
    (pad "4" smd rect (at -8.89 -16.51) (size 2.96 1.7) (drill (offset -0.63 0)) (layers "F.Cu" "F.Mask")
      (net 6 "unconnected-(U1-Pad4)") (pinfunction "GPIO2") (pintype "bidirectional") (tstamp c71b4620-6d79-41dc-a389-067acc953d54))
    (pad "4" thru_hole oval (at -8.89 -16.51) (size 1.7 1.7) (drill 1.02) (layers *.Cu *.Mask)
      (net 6 "unconnected-(U1-Pad4)") (pinfunction "GPIO2") (pintype "bidirectional") (tstamp e02820d9-8ec2-44a1-a266-d614c0cd8c97))
    (pad "5" smd rect (at -8.89 -13.97) (size 2.96 1.7) (drill (offset -0.63 0)) (layers "F.Cu" "F.Mask")
      (net 54 "unconnected-(U1-Pad5)") (pinfunction "GPIO3") (pintype "bidirectional") (tstamp 92ce59e9-1919-48f3-9c29-aa1540dde63a))
    (pad "5" thru_hole oval (at -8.89 -13.97) (size 1.7 1.7) (drill 1.02) (layers *.Cu *.Mask)
      (net 54 "unconnected-(U1-Pad5)") (pinfunction "GPIO3") (pintype "bidirectional") (tstamp 94cef7bd-ca5e-461b-a0fe-c6e185df2388))
    (pad "6" smd rect (at -8.89 -11.43) (size 2.96 1.7) (drill (offset -0.63 0)) (layers "F.Cu" "F.Mask")
      (net 7 "unconnected-(U1-Pad6)") (pinfunction "GPIO4") (pintype "bidirectional") (tstamp 20f78eee-12b5-4265-b88e-e361a7429719))
    (pad "6" thru_hole oval (at -8.89 -11.43) (size 1.7 1.7) (drill 1.02) (layers *.Cu *.Mask)
      (net 7 "unconnected-(U1-Pad6)") (pinfunction "GPIO4") (pintype "bidirectional") (tstamp 73611170-5092-4c04-a0ff-0cae61e9e483))
    (pad "7" smd rect (at -8.89 -8.89) (size 2.96 1.74) (drill (offset -0.63 0.02)) (layers "F.Cu" "F.Mask")
      (net 8 "unconnected-(U1-Pad7)") (pinfunction "GPIO5") (pintype "bidirectional") (tstamp 98a85ac5-34af-4581-ad9c-b2385edb0f6d))
    (pad "7" thru_hole oval (at -8.89 -8.89) (size 1.7 1.7) (drill 1.02) (layers *.Cu *.Mask)
      (net 8 "unconnected-(U1-Pad7)") (pinfunction "GPIO5") (pintype "bidirectional") (tstamp f265516a-aaf6-4312-ba87-4db12f1cfe6f))
    (pad "8" thru_hole rect (at -8.89 -6.35) (size 1.7 1.7) (drill 1.02) (layers *.Cu *.Mask)
      (net 9 "unconnected-(U1-Pad8)") (pinfunction "GND") (pintype "power_in") (tstamp 00a638d1-bfc5-4dcd-89df-2ce5adeca0c0))
    (pad "8" smd rect (at -8.89 -6.35) (size 2.96 1.7) (drill (offset -0.63 0)) (layers "F.Cu" "F.Mask")
      (net 9 "unconnected-(U1-Pad8)") (pinfunction "GND") (pintype "power_in") (tstamp bee7f3a9-3858-40cb-a1f4-2c577c301d26))
    (pad "9" smd rect (at -8.89 -3.81) (size 2.96 1.7) (drill (offset -0.63 0)) (layers "F.Cu" "F.Mask")
      (net 10 "unconnected-(U1-Pad9)") (pinfunction "GPIO6") (pintype "bidirectional") (tstamp 783d9714-35d9-45b8-9faf-4f11669a87a5))
    (pad "9" thru_hole oval (at -8.89 -3.81) (size 1.7 1.7) (drill 1.02) (layers *.Cu *.Mask)
      (net 10 "unconnected-(U1-Pad9)") (pinfunction "GPIO6") (pintype "bidirectional") (tstamp f633f378-f7ab-47ca-850c-6fc04348b1d1))
    (pad "10" smd rect (at -8.89 -1.27) (size 2.96 1.7) (drill (offset -0.63 0)) (layers "F.Cu" "F.Mask")
      (net 11 "unconnected-(U1-Pad10)") (pinfunction "GPIO7") (pintype "bidirectional") (tstamp c9528706-41ca-4778-9842-0156bac5b3f2))
    (pad "10" thru_hole oval (at -8.89 -1.27) (size 1.7 1.7) (drill 1.02) (layers *.Cu *.Mask)
      (net 11 "unconnected-(U1-Pad10)") (pinfunction "GPIO7") (pintype "bidirectional") (tstamp e58711cd-8ef7-434d-8c5a-5bdd7a322f8f))
    (pad "11" thru_hole oval (at -8.89 1.27) (size 1.7 1.7) (drill 1.02) (layers *.Cu *.Mask)
      (net 12 "unconnected-(U1-Pad11)") (pinfunction "GPIO8") (pintype "bidirectional") (tstamp 4dcf33c6-5f0b-44ce-a18f-c4435575a723))
    (pad "11" smd rect (at -8.89 1.27) (size 2.96 1.7) (drill (offset -0.63 0)) (layers "F.Cu" "F.Mask")
      (net 12 "unconnected-(U1-Pad11)") (pinfunction "GPIO8") (pintype "bidirectional") (tstamp c69ef057-9db7-4ee2-9373-6f342ac06b7f))
    (pad "12" smd rect (at -8.89 3.81) (size 2.96 1.7) (drill (offset -0.63 0)) (layers "F.Cu" "F.Mask")
      (net 13 "unconnected-(U1-Pad12)") (pinfunction "GPIO9") (pintype "bidirectional") (tstamp 077354f1-7c81-4092-8cfb-a482b097f5c7))
    (pad "12" thru_hole oval (at -8.89 3.81) (size 1.7 1.7) (drill 1.02) (layers *.Cu *.Mask)
      (net 13 "unconnected-(U1-Pad12)") (pinfunction "GPIO9") (pintype "bidirectional") (tstamp 71db61a1-d272-4e8d-bd8c-f49949c90cbd))
    (pad "13" thru_hole rect (at -8.89 6.35) (size 1.7 1.7) (drill 1.02) (layers *.Cu *.Mask)
      (net 14 "unconnected-(U1-Pad13)") (pinfunction "GND") (pintype "power_in") (tstamp ca78a5ec-0e07-4783-bca2-901a9623239b))
    (pad "13" smd rect (at -8.89 6.35) (size 2.96 1.7) (drill (offset -0.63 0)) (layers "F.Cu" "F.Mask")
      (net 14 "unconnected-(U1-Pad13)") (pinfunction "GND") (pintype "power_in") (tstamp fba03eb2-e33e-4ff7-8bac-112d00f7de03))
    (pad "14" thru_hole oval (at -8.89 8.89) (size 1.7 1.7) (drill 1.02) (layers *.Cu *.Mask)
      (net 15 "unconnected-(U1-Pad14)") (pinfunction "GPIO10") (pintype "bidirectional") (tstamp a34264ca-bc7b-4fdd-8084-8a4444ac7f00))
    (pad "14" smd rect (at -8.89 8.89) (size 2.96 1.7) (drill (offset -0.63 0)) (layers "F.Cu" "F.Mask")
      (net 15 "unconnected-(U1-Pad14)") (pinfunction "GPIO10") (pintype "bidirectional") (tstamp e58dd0a0-f7a8-4c7a-8437-b91a27261650))
    (pad "15" smd rect (at -8.89 11.43) (size 2.96 1.7) (drill (offset -0.63 0)) (layers "F.Cu" "F.Mask")
      (net 16 "unconnected-(U1-Pad15)") (pinfunction "GPIO11") (pintype "bidirectional") (tstamp 1fb25a69-2dbf-4a38-b09d-4023de45b551))
    (pad "15" thru_hole oval (at -8.89 11.43) (size 1.7 1.7) (drill 1.02) (layers *.Cu *.Mask)
      (net 16 "unconnected-(U1-Pad15)") (pinfunction "GPIO11") (pintype "bidirectional") (tstamp 56d08f83-ef25-4a20-a621-b20be216db81))
    (pad "16" smd rect (at -8.89 13.97) (size 2.96 1.7) (drill (offset -0.63 0)) (layers "F.Cu" "F.Mask")
      (net 17 "Net-(U1-Pad16)") (pinfunction "GPIO12") (pintype "bidirectional") (tstamp 6794b94d-f216-4a0b-a537-c9605839a8fc))
    (pad "16" thru_hole oval (at -8.89 13.97) (size 1.7 1.7) (drill 1.02) (layers *.Cu *.Mask)
      (net 17 "Net-(U1-Pad16)") (pinfunction "GPIO12") (pintype "bidirectional") (tstamp 67da69a5-84d4-4f27-9892-4c32e64c5e64))
    (pad "17" thru_hole oval (at -8.89 16.51) (size 1.7 1.7) (drill 1.02) (layers *.Cu *.Mask)
      (net 18 "unconnected-(U1-Pad17)") (pinfunction "GPIO13") (pintype "bidirectional") (tstamp 00738e07-ff5d-4f7e-a8ad-82ad42835818))
    (pad "17" smd rect (at -8.89 16.51) (size 2.96 1.7) (drill (offset -0.63 0)) (layers "F.Cu" "F.Mask")
      (net 18 "unconnected-(U1-Pad17)") (pinfunction "GPIO13") (pintype "bidirectional") (tstamp a8561ac5-384c-4564-8de3-2b62b4ac3cf6))
    (pad "18" smd rect (at -8.89 19.05) (size 2.96 1.7) (drill (offset -0.63 0)) (layers "F.Cu" "F.Mask")
      (net 3 "GNDREF") (pinfunction "GND") (pintype "power_in") (tstamp 78746421-c7c0-4cfd-9968-7ad362a3becb))
    (pad "18" thru_hole rect (at -8.89 19.05) (size 1.7 1.7) (drill 1.02) (layers *.Cu *.Mask)
      (net 3 "GNDREF") (pinfunction "GND") (pintype "power_in") (tstamp 83d7566b-de1e-48c9-ab9b-a66505cf4130))
    (pad "19" thru_hole oval (at -8.89 21.59) (size 1.7 1.7) (drill 1.02) (layers *.Cu *.Mask)
      (net 19 "unconnected-(U1-Pad19)") (pinfunction "GPIO14") (pintype "bidirectional") (tstamp 4202cb78-a835-47bd-ae6b-30c40cab40be))
    (pad "19" smd rect (at -8.89 21.59) (size 2.96 1.7) (drill (offset -0.63 0)) (layers "F.Cu" "F.Mask")
      (net 19 "unconnected-(U1-Pad19)") (pinfunction "GPIO14") (pintype "bidirectional") (tstamp f65ef9be-32e2-468e-9b3f-1a9b89a3c808))
    (pad "20" thru_hole oval (at -8.89 24.13) (size 1.7 1.7) (drill 1.02) (layers *.Cu *.Mask)
      (net 55 "unconnected-(U1-Pad20)") (pinfunction "GPIO15") (pintype "bidirectional") (tstamp 130a151c-5a9e-4acd-9331-4d5a112b395f))
    (pad "20" smd rect (at -8.89 24.13) (size 2.96 1.7) (drill (offset -0.63 0)) (layers "F.Cu" "F.Mask")
      (net 55 "unconnected-(U1-Pad20)") (pinfunction "GPIO15") (pintype "bidirectional") (tstamp 9d19e90c-9fc0-4b1b-bcfd-ca073698ea34))
    (pad "21" smd rect (at 8.89 24.13) (size 2.96 1.7) (drill (offset 0.63 0)) (layers "F.Cu" "F.Mask")
      (net 20 "unconnected-(U1-Pad21)") (pinfunction "GPIO16") (pintype "bidirectional") (tstamp 0300c621-1007-42b3-a548-537dfddf2f61))
    (pad "21" thru_hole oval (at 8.89 24.13) (size 1.7 1.7) (drill 1.02) (layers *.Cu *.Mask)
      (net 20 "unconnected-(U1-Pad21)") (pinfunction "GPIO16") (pintype "bidirectional") (tstamp 2c0030a1-0df6-46f6-b433-a15490734c90))
    (pad "22" thru_hole oval (at 8.89 21.59) (size 1.7 1.7) (drill 1.02) (layers *.Cu *.Mask)
      (net 21 "unconnected-(U1-Pad22)") (pinfunction "GPIO17") (pintype "bidirectional") (tstamp 3a30f2b0-61bd-4535-a567-0a950f9ca3ff))
    (pad "22" smd rect (at 8.89 21.59) (size 2.96 1.7) (drill (offset 0.63 0)) (layers "F.Cu" "F.Mask")
      (net 21 "unconnected-(U1-Pad22)") (pinfunction "GPIO17") (pintype "bidirectional") (tstamp c5efbf95-2d8e-4888-9b36-38c7c7d10ae8))
    (pad "23" thru_hole rect (at 8.89 19.05) (size 1.7 1.7) (drill 1.02) (layers *.Cu *.Mask)
      (net 22 "unconnected-(U1-Pad23)") (pinfunction "GND") (pintype "power_in") (tstamp 9a043a5f-1c06-4618-86c9-b543779f6d1f))
    (pad "23" smd rect (at 8.89 19.05) (size 2.96 1.7) (drill (offset 0.63 0)) (layers "F.Cu" "F.Mask")
      (net 22 "unconnected-(U1-Pad23)") (pinfunction "GND") (pintype "power_in") (tstamp ead18900-e54b-4318-bbc7-ebfa13d7aa19))
    (pad "24" thru_hole oval (at 8.89 16.51) (size 1.7 1.7) (drill 1.02) (layers *.Cu *.Mask)
      (net 23 "unconnected-(U1-Pad24)") (pinfunction "GPIO18") (pintype "bidirectional") (tstamp 38fd8a11-db59-48a3-937f-a488fe621e4f))
    (pad "24" smd rect (at 8.89 16.51) (size 2.96 1.7) (drill (offset 0.63 0)) (layers "F.Cu" "F.Mask")
      (net 23 "unconnected-(U1-Pad24)") (pinfunction "GPIO18") (pintype "bidirectional") (tstamp f7e04669-fa49-49ca-b3e8-6e3c60c678bd))
    (pad "25" smd rect (at 8.89 13.97) (size 2.96 1.7) (drill (offset 0.63 0)) (layers "F.Cu" "F.Mask")
      (net 24 "unconnected-(U1-Pad25)") (pinfunction "GPIO19") (pintype "bidirectional") (tstamp 95445810-e610-47c7-b578-722b3bb73f85))
    (pad "25" thru_hole oval (at 8.89 13.97) (size 1.7 1.7) (drill 1.02) (layers *.Cu *.Mask)
      (net 24 "unconnected-(U1-Pad25)") (pinfunction "GPIO19") (pintype "bidirectional") (tstamp f6192cdc-45d6-42b7-9bfa-a2eb86d8f3bd))
    (pad "26" smd rect (at 8.89 11.43) (size 2.96 1.7) (drill (offset 0.63 0)) (layers "F.Cu" "F.Mask")
      (net 25 "unconnected-(U1-Pad26)") (pinfunction "GPIO20") (pintype "bidirectional") (tstamp acfb4676-eb71-4367-aa14-e748dac3befe))
    (pad "26" thru_hole oval (at 8.89 11.43) (size 1.7 1.7) (drill 1.02) (layers *.Cu *.Mask)
      (net 25 "unconnected-(U1-Pad26)") (pinfunction "GPIO20") (pintype "bidirectional") (tstamp ca77da8d-d4bf-4b04-9c1f-05c71bfbb585))
    (pad "27" smd rect (at 8.89 8.89) (size 2.96 1.7) (drill (offset 0.63 0)) (layers "F.Cu" "F.Mask")
      (net 26 "unconnected-(U1-Pad27)") (pinfunction "GPIO21") (pintype "bidirectional") (tstamp 85fa5704-8fd8-4f8a-b4a7-049227a2e39f))
    (pad "27" thru_hole oval (at 8.89 8.89) (size 1.7 1.7) (drill 1.02) (layers *.Cu *.Mask)
      (net 26 "unconnected-(U1-Pad27)") (pinfunction "GPIO21") (pintype "bidirectional") (tstamp a433789b-a541-4f8a-9599-b776d735d765))
    (pad "28" smd rect (at 8.89 6.35) (size 2.96 1.7) (drill (offset 0.63 0)) (layers "F.Cu" "F.Mask")
      (net 27 "unconnected-(U1-Pad28)") (pinfunction "GND") (pintype "power_in") (tstamp bce92480-8c10-430c-8c44-8f5531a37e92))
    (pad "28" thru_hole rect (at 8.89 6.35) (size 1.7 1.7) (drill 1.02) (layers *.Cu *.Mask)
      (net 27 "unconnected-(U1-Pad28)") (pinfunction "GND") (pintype "power_in") (tstamp f50ea3f6-9887-4dc3-9ec9-7a0fb1ee7721))
    (pad "29" smd rect (at 8.89 3.81) (size 2.96 1.7) (drill (offset 0.63 0)) (layers "F.Cu" "F.Mask")
      (net 28 "unconnected-(U1-Pad29)") (pinfunction "GPIO22") (pintype "bidirectional") (tstamp 46f85ca6-a340-44f7-933d-6a8e31c96d75))
    (pad "29" thru_hole oval (at 8.89 3.81) (size 1.7 1.7) (drill 1.02) (layers *.Cu *.Mask)
      (net 28 "unconnected-(U1-Pad29)") (pinfunction "GPIO22") (pintype "bidirectional") (tstamp 638c2b68-5c53-4d76-b95b-019c6912b059))
    (pad "30" smd rect (at 8.89 1.27) (size 2.96 1.7) (drill (offset 0.63 0)) (layers "F.Cu" "F.Mask")
      (net 29 "unconnected-(U1-Pad30)") (pinfunction "RUN") (pintype "input") (tstamp 1938ac0a-a852-469c-aaff-eb235f04d892))
    (pad "30" thru_hole oval (at 8.89 1.27) (size 1.7 1.7) (drill 1.02) (layers *.Cu *.Mask)
      (net 29 "unconnected-(U1-Pad30)") (pinfunction "RUN") (pintype "input") (tstamp 6096f853-7b39-4e9e-b8af-5844013346f9))
    (pad "31" smd rect (at 8.89 -1.27) (size 2.96 1.58) (drill (offset 0.63 0.06)) (layers "F.Cu" "F.Mask")
      (net 50 "Net-(D2-Pad1)") (pinfunction "GPIO26_ADC0") (pintype "bidirectional") (tstamp 8b8d16cf-c006-49ad-9970-e3d988d42355))
    (pad "31" thru_hole oval (at 8.89 -1.27) (size 1.7 1.7) (drill 1.02) (layers *.Cu *.Mask)
      (net 50 "Net-(D2-Pad1)") (pinfunction "GPIO26_ADC0") (pintype "bidirectional") (tstamp 92e3ef4b-ffee-4c5d-ad25-da869d2866f7))
    (pad "32" thru_hole oval (at 8.89 -3.81) (size 1.7 1.7) (drill 1.02) (layers *.Cu *.Mask)
      (net 30 "unconnected-(U1-Pad32)") (pinfunction "GPIO27_ADC1") (pintype "bidirectional") (tstamp 3419bb77-1195-490c-ad1c-66834c780b7f))
    (pad "32" smd rect (at 8.89 -3.81) (size 2.96 1.7) (drill (offset 0.63 0)) (layers "F.Cu" "F.Mask")
      (net 30 "unconnected-(U1-Pad32)") (pinfunction "GPIO27_ADC1") (pintype "bidirectional") (tstamp 64af3265-2eb8-495d-851e-ecd12df8d574))
    (pad "33" smd rect (at 8.89 -6.35) (size 2.96 1.7) (drill (offset 0.63 0)) (layers "F.Cu" "F.Mask")
      (net 31 "unconnected-(U1-Pad33)") (pinfunction "AGND") (pintype "power_in") (tstamp 51151b4b-bc5e-4a2b-9224-5349bc879f5b))
    (pad "33" thru_hole rect (at 8.89 -6.35) (size 1.7 1.7) (drill 1.02) (layers *.Cu *.Mask)
      (net 31 "unconnected-(U1-Pad33)") (pinfunction "AGND") (pintype "power_in") (tstamp 9fc5920d-03e1-4053-90ce-8b713bdc2e98))
    (pad "34" thru_hole oval (at 8.89 -8.89) (size 1.7 1.7) (drill 1.02) (layers *.Cu *.Mask)
      (net 32 "unconnected-(U1-Pad34)") (pinfunction "GPIO28_ADC2") (pintype "bidirectional") (tstamp 04fb0cd4-0bb6-49aa-ab7a-37f2c8e3bfdf))
    (pad "34" smd rect (at 8.89 -8.89) (size 2.96 1.7) (drill (offset 0.63 0)) (layers "F.Cu" "F.Mask")
      (net 32 "unconnected-(U1-Pad34)") (pinfunction "GPIO28_ADC2") (pintype "bidirectional") (tstamp 22e8adfd-f463-4836-99f0-c98388c7ac27))
    (pad "35" smd rect (at 8.89 -11.43) (size 2.96 1.7) (drill (offset 0.63 0)) (layers "F.Cu" "F.Mask")
      (net 33 "unconnected-(U1-Pad35)") (pinfunction "ADC_VREF") (pintype "unspecified") (tstamp 0aa3beed-33f5-4121-ac3c-bfca1445c8a8))
    (pad "35" thru_hole oval (at 8.89 -11.43) (size 1.7 1.7) (drill 1.02) (layers *.Cu *.Mask)
      (net 33 "unconnected-(U1-Pad35)") (pinfunction "ADC_VREF") (pintype "unspecified") (tstamp b1126b5d-a20e-4895-b462-afcd166fd914))
    (pad "36" thru_hole oval (at 8.89 -13.97) (size 1.7 1.7) (drill 1.02) (layers *.Cu *.Mask)
      (net 34 "+3.3V") (pinfunction "3V3") (pintype "unspecified") (tstamp 006921c7-2a96-4d98-ae7e-64cce641d5e2))
    (pad "36" smd rect (at 8.89 -13.97) (size 2.96 1.7) (drill (offset 0.63 0)) (layers "F.Cu" "F.Mask")
      (net 34 "+3.3V") (pinfunction "3V3") (pintype "unspecified") (tstamp d5f710ce-5125-4ee4-be37-3636101ba4b1))
    (pad "37" thru_hole oval (at 8.89 -16.51) (size 1.7 1.7) (drill 1.02) (layers *.Cu *.Mask)
      (net 35 "unconnected-(U1-Pad37)") (pinfunction "3V3_EN") (pintype "input") (tstamp 6beb6b87-d08a-4ac9-bd3b-b2349a5ac0b2))
    (pad "37" smd rect (at 8.89 -16.51) (size 2.96 1.7) (drill (offset 0.63 0)) (layers "F.Cu" "F.Mask")
      (net 35 "unconnected-(U1-Pad37)") (pinfunction "3V3_EN") (pintype "input") (tstamp c9f71636-0b4b-47d3-a91e-a1ea810693f3))
    (pad "38" thru_hole rect (at 8.89 -19.05) (size 1.7 1.7) (drill 1.02) (layers *.Cu *.Mask)
      (net 36 "unconnected-(U1-Pad38)") (pinfunction "GND") (pintype "bidirectional") (tstamp 3d281b48-3de8-4c28-98e7-7f573d5ac830))
    (pad "38" smd rect (at 8.89 -19.05) (size 2.96 1.7) (drill (offset 0.63 0)) (layers "F.Cu" "F.Mask")
      (net 36 "unconnected-(U1-Pad38)") (pinfunction "GND") (pintype "bidirectional") (tstamp a8a5bfbe-cdf2-4c25-96f3-eeaee7f46c56))
    (pad "39" smd rect (at 8.89 -21.59) (size 2.96 1.7) (drill (offset 0.63 0)) (layers "F.Cu" "F.Mask")
      (net 51 "Net-(D1-Pad1)") (pinfunction "VSYS") (pintype "unspecified") (tstamp 4933761c-e360-4b73-b08a-056859245b5f))
    (pad "39" thru_hole oval (at 8.89 -21.59) (size 1.7 1.7) (drill 1.02) (layers *.Cu *.Mask)
      (net 51 "Net-(D1-Pad1)") (pinfunction "VSYS") (pintype "unspecified") (tstamp de796b3b-bad1-4e19-83d4-f023b226c238))
    (pad "40" smd rect (at 8.89 -24.13) (size 2.96 1.7) (drill (offset 0.63 0)) (layers "F.Cu" "F.Mask")
      (net 37 "unconnected-(U1-Pad40)") (pinfunction "VBUS") (pintype "unspecified") (tstamp 2a38b809-f858-4d94-b98b-86010b4c5ee9))
    (pad "40" thru_hole oval (at 8.89 -24.13) (size 1.7 1.7) (drill 1.02) (layers *.Cu *.Mask)
      (net 37 "unconnected-(U1-Pad40)") (pinfunction "VBUS") (pintype "unspecified") (tstamp fa065906-32b9-41a1-a6e0-56d85d212fb2))
    (pad "41" thru_hole oval (at -2.54 23.9) (size 1.7 1.7) (drill 1.02) (layers *.Cu *.Mask)
      (net 38 "unconnected-(U1-Pad41)") (pinfunction "SWCLK") (pintype "input") (tstamp 9094bebd-3320-424d-bd13-f12f539d7c7d))
    (pad "41" smd rect (at -2.54 23.9 90) (size 2.95 1.7) (drill (offset -0.625 0)) (layers "F.Cu" "F.Mask")
      (net 38 "unconnected-(U1-Pad41)") (pinfunction "SWCLK") (pintype "input") (tstamp 9ce23001-4bd5-46ab-ac87-cb915687a3df))
    (pad "42" smd rect (at 0 23.9 90) (size 2.95 1.7) (drill (offset -0.625 0)) (layers "F.Cu" "F.Mask")
      (net 39 "unconnected-(U1-Pad42)") (pinfunction "GND") (pintype "power_in") (tstamp 983d6e9a-cea0-4035-8cc1-b9e21fc84289))
    (pad "42" thru_hole rect (at 0 23.9) (size 1.7 1.7) (drill 1.02) (layers *.Cu *.Mask)
      (net 39 "unconnected-(U1-Pad42)") (pinfunction "GND") (pintype "power_in") (tstamp ea71a934-761c-4ba9-9b6b-f4d951ec6b22))
    (pad "43" thru_hole oval (at 2.54 23.9) (size 1.7 1.7) (drill 1.02) (layers *.Cu *.Mask)
      (net 40 "unconnected-(U1-Pad43)") (pinfunction "SWDIO") (pintype "bidirectional") (tstamp 5013974e-05b6-4e55-a45a-a53c925351a8))
    (pad "43" smd rect (at 2.54 23.9 90) (size 2.95 1.7) (drill (offset -0.625 0)) (layers "F.Cu" "F.Mask")
      (net 40 "unconnected-(U1-Pad43)") (pinfunction "SWDIO") (pintype "bidirectional") (tstamp df923ba6-7d0a-4190-825d-d3699b43e689))
  )

  (footprint "Resistor_THT:R_Axial_DIN0207_L6.3mm_D2.5mm_P10.16mm_Horizontal" (layer "F.Cu")
    (tedit 5AE5139B) (tstamp c401e9c6-1deb-4979-99be-7c801c952098)
    (at 55.900234 101.639211 90)
    (descr "Resistor, Axial_DIN0207 series, Axial, Horizontal, pin pitch=10.16mm, 0.25W = 1/4W, length*diameter=6.3*2.5mm^2, http://cdn-reichelt.de/documents/datenblatt/B400/1_4W%23YAG.pdf")
    (tags "Resistor Axial_DIN0207 series Axial Horizontal pin pitch 10.16mm 0.25W = 1/4W length 6.3mm diameter 2.5mm")
    (property "Sheetfile" "wordclock.kicad_sch")
    (property "Sheetname" "")
    (path "/5d8c01f1-039f-4975-b6e5-efdd848250da")
    (attr through_hole)
    (fp_text reference "R2" (at 3.039211 -2.800234 90) (layer "F.SilkS")
      (effects (font (size 1 1) (thickness 0.15)))
      (tstamp 29126f72-63f7-4275-8b12-6b96a71c6f17)
    )
    (fp_text value "4,7kΩ" (at 6.539211 -2.800234 90) (layer "F.Fab")
      (effects (font (size 1 1) (thickness 0.15)))
      (tstamp 9da1ace0-4181-4f12-80f8-16786a9e5c07)
    )
    (fp_text user "${REFERENCE}" (at 5.08 0 90) (layer "F.Fab")
      (effects (font (size 1 1) (thickness 0.15)))
      (tstamp d8200a86-aa75-47a3-ad2a-7f4c9c999a6f)
    )
    (fp_line (start 8.35 -1.37) (end 1.81 -1.37) (layer "F.SilkS") (width 0.12) (tstamp 275b6416-db29-42cc-9307-bf426917c3b4))
    (fp_line (start 1.81 -1.37) (end 1.81 1.37) (layer "F.SilkS") (width 0.12) (tstamp 4086cbd7-6ba7-4e63-8da9-17e60627ee17))
    (fp_line (start 9.12 0) (end 8.35 0) (layer "F.SilkS") (width 0.12) (tstamp 465137b4-f6f7-4d51-9b40-b161947d5cc1))
    (fp_line (start 1.81 1.37) (end 8.35 1.37) (layer "F.SilkS") (width 0.12) (tstamp 91fc5800-6029-46b1-848d-ca0091f97267))
    (fp_line (start 8.35 1.37) (end 8.35 -1.37) (layer "F.SilkS") (width 0.12) (tstamp bb8162f0-99c8-4884-be5b-c0d0c7e81ff6))
    (fp_line (start 1.04 0) (end 1.81 0) (layer "F.SilkS") (width 0.12) (tstamp d1cd5391-31d2-459f-8adb-4ae3f304a833))
    (fp_line (start 11.21 1.5) (end 11.21 -1.5) (layer "F.CrtYd") (width 0.05) (tstamp 3c22d605-7855-4cc6-8ad2-906cadbd02dc))
    (fp_line (start -1.05 -1.5) (end -1.05 1.5) (layer "F.CrtYd") (width 0.05) (tstamp 8eb98c56-17e4-4de6-a3e3-06dcfa392040))
    (fp_line (start 11.21 -1.5) (end -1.05 -1.5) (layer "F.CrtYd") (width 0.05) (tstamp bd085057-7c0e-463a-982b-968a2dc1f0f8))
    (fp_line (start -1.05 1.5) (end 11.21 1.5) (layer "F.CrtYd") (width 0.05) (tstamp c66a19ed-90c0-4502-ae75-6a4c4ab9f297))
    (fp_line (start 1.93 -1.25) (end 1.93 1.25) (layer "F.Fab") (width 0.1) (tstamp 0554bea0-89b2-4e25-9ea3-4c73921c94cb))
    (fp_line (start 8.23 -1.25) (end 1.93 -1.25) (layer "F.Fab") (width 0.1) (tstamp 22962957-1efd-404d-83db-5b233b6c15b0))
    (fp_line (start 8.23 1.25) (end 8.23 -1.25) (layer "F.Fab") (width 0.1) (tstamp 88606262-3ac5-44a1-aacc-18b26cf4d396))
    (fp_line (start 0 0) (end 1.93 0) (layer "F.Fab") (width 0.1) (tstamp 8d063f79-9282-4820-bcf4-1ff3c006cf08))
    (fp_line (start 10.16 0) (end 8.23 0) (layer "F.Fab") (width 0.1) (tstamp af186015-d283-4209-aade-a247e5de01df))
    (fp_line (start 1.93 1.25) (end 8.23 1.25) (layer "F.Fab") (width 0.1) (tstamp cd1cff81-9d8a-4511-96d6-4ddb79484001))
    (pad "1" thru_hole circle (at 0 0 90) (size 1.6 1.6) (drill 0.8) (layers *.Cu *.Mask)
      (net 3 "GNDREF") (pintype "passive") (tstamp 355ced6c-c08a-4586-9a09-7a9c624536f6))
    (pad "2" thru_hole oval (at 10.16 0 90) (size 1.6 1.6) (drill 0.8) (layers *.Cu *.Mask)
      (net 50 "Net-(D2-Pad1)") (pintype "passive") (tstamp c2dd13db-24b6-40f1-b75b-b9ab893d92ea))
    (model "${KICAD6_3DMODEL_DIR}/Resistor_THT.3dshapes/R_Axial_DIN0207_L6.3mm_D2.5mm_P10.16mm_Horizontal.wrl"
      (offset (xyz 0 0 0))
      (scale (xyz 1 1 1))
      (rotate (xyz 0 0 0))
    )
  )

  (footprint "Resistor_THT:R_Axial_DIN0207_L6.3mm_D2.5mm_P10.16mm_Horizontal" (layer "F.Cu")
    (tedit 5AE5139B) (tstamp d13b0eae-4711-4325-a6bb-aa8e3646e86e)
    (at 60.96 91.44 -90)
    (descr "Resistor, Axial_DIN0207 series, Axial, Horizontal, pin pitch=10.16mm, 0.25W = 1/4W, length*diameter=6.3*2.5mm^2, http://cdn-reichelt.de/documents/datenblatt/B400/1_4W%23YAG.pdf")
    (tags "Resistor Axial_DIN0207 series Axial Horizontal pin pitch 10.16mm 0.25W = 1/4W length 6.3mm diameter 2.5mm")
    (property "Sheetfile" "wordclock.kicad_sch")
    (property "Sheetname" "")
    (path "/72338b3b-b76e-45f0-bb64-156d1cb79cbe")
    (attr through_hole)
    (fp_text reference "R1" (at 6.86 2.46 90) (layer "F.SilkS")
      (effects (font (size 1 1) (thickness 0.15)))
      (tstamp 653a86ba-a1ae-4175-9d4c-c788087956d0)
    )
    (fp_text value "470Ω" (at 3.36 2.36 90) (layer "F.Fab")
      (effects (font (size 1 1) (thickness 0.15)))
      (tstamp 3ed2c840-383d-4cbd-bc3b-c4ea4c97b333)
    )
    (fp_text user "${REFERENCE}" (at 5.08 0 90) (layer "F.Fab")
      (effects (font (size 1 1) (thickness 0.15)))
      (tstamp b54cae5b-c17c-4ed7-b249-2e7d5e83609a)
    )
    (fp_line (start 8.35 1.37) (end 8.35 -1.37) (layer "F.SilkS") (width 0.12) (tstamp 1317ff66-8ecf-46c9-9612-8d2eae03c537))
    (fp_line (start 1.81 -1.37) (end 1.81 1.37) (layer "F.SilkS") (width 0.12) (tstamp 1755646e-fc08-4e43-a301-d9b3ea704cf6))
    (fp_line (start 9.12 0) (end 8.35 0) (layer "F.SilkS") (width 0.12) (tstamp 26bc8641-9bca-4204-9709-deedbe202a36))
    (fp_line (start 1.81 1.37) (end 8.35 1.37) (layer "F.SilkS") (width 0.12) (tstamp ef4533db-6ea4-4b68-b436-8e9575be570d))
    (fp_line (start 8.35 -1.37) (end 1.81 -1.37) (layer "F.SilkS") (width 0.12) (tstamp f5dba25f-5f9b-4770-84f9-c038fb119360))
    (fp_line (start 1.04 0) (end 1.81 0) (layer "F.SilkS") (width 0.12) (tstamp fd5f7d77-0f73-4021-88a8-0641f0fe8d98))
    (fp_line (start 11.21 -1.5) (end -1.05 -1.5) (layer "F.CrtYd") (width 0.05) (tstamp 63caf46e-0228-40de-b819-c6bd29dd1711))
    (fp_line (start 11.21 1.5) (end 11.21 -1.5) (layer "F.CrtYd") (width 0.05) (tstamp 8aff0f38-92a8-45ec-b106-b185e93ca3fd))
    (fp_line (start -1.05 -1.5) (end -1.05 1.5) (layer "F.CrtYd") (width 0.05) (tstamp 94a10cae-6ef2-4b64-9d98-fb22aa3306cc))
    (fp_line (start -1.05 1.5) (end 11.21 1.5) (layer "F.CrtYd") (width 0.05) (tstamp a7fc0812-140f-4d96-9cd8-ead8c1c610b1))
    (fp_line (start 1.93 1.25) (end 8.23 1.25) (layer "F.Fab") (width 0.1) (tstamp 0ba17a9b-d889-426c-b4fe-048bed6b6be8))
    (fp_line (start 0 0) (end 1.93 0) (layer "F.Fab") (width 0.1) (tstamp 7233cb6b-d8fd-4fcd-9b4f-8b0ed19b1b12))
    (fp_line (start 8.23 1.25) (end 8.23 -1.25) (layer "F.Fab") (width 0.1) (tstamp 761c8e29-382a-475c-a37a-7201cc9cd0f5))
    (fp_line (start 10.16 0) (end 8.23 0) (layer "F.Fab") (width 0.1) (tstamp df83f395-2d18-47e2-a370-952ca41c2b3a))
    (fp_line (start 1.93 -1.25) (end 1.93 1.25) (layer "F.Fab") (width 0.1) (tstamp e50c80c5-80c4-46a3-8c1e-c9c3a71a0934))
    (fp_line (start 8.23 -1.25) (end 1.93 -1.25) (layer "F.Fab") (width 0.1) (tstamp f33ec0db-ef0f-4576-8054-2833161a8f30))
    (pad "1" thru_hole circle (at 0 0 270) (size 1.6 1.6) (drill 0.8) (layers *.Cu *.Mask)
      (net 2 "Net-(J2-Pad1)") (pintype "passive") (tstamp a917c6d9-225d-4c90-bf25-fe8eff8abd3f))
    (pad "2" thru_hole oval (at 10.16 0 270) (size 1.6 1.6) (drill 0.8) (layers *.Cu *.Mask)
      (net 53 "Net-(R1-Pad2)") (pintype "passive") (tstamp 89a3dae6-dcb5-435b-a383-656b6a19a316))
    (model "${KICAD6_3DMODEL_DIR}/Resistor_THT.3dshapes/R_Axial_DIN0207_L6.3mm_D2.5mm_P10.16mm_Horizontal.wrl"
      (offset (xyz 0 0 0))
      (scale (xyz 1 1 1))
      (rotate (xyz 0 0 0))
    )
  )

  (footprint "Diode_THT:D_DO-35_SOD27_P7.62mm_Horizontal" (layer "F.Cu")
    (tedit 5AE50CD5) (tstamp e65bab67-68b7-4b22-a939-6f2c05164d2a)
    (at 66.019765 91.47984 -90)
    (descr "Diode, DO-35_SOD27 series, Axial, Horizontal, pin pitch=7.62mm, , length*diameter=4*2mm^2, , http://www.diodes.com/_files/packages/DO-35.pdf")
    (tags "Diode DO-35_SOD27 series Axial Horizontal pin pitch 7.62mm  length 4mm diameter 2mm")
    (property "Sheetfile" "wordclock.kicad_sch")
    (property "Sheetname" "")
    (path "/fea06963-0b23-4c7e-b5f5-a815511e9f52")
    (attr through_hole)
    (fp_text reference "D1" (at 7.22016 2.219765 90) (layer "F.SilkS")
      (effects (font (size 1 1) (thickness 0.15)))
      (tstamp f4a1ab68-998b-43e3-aa33-40b58210bc99)
    )
    (fp_text value "SD103B" (at 3.12016 2.219765 90) (layer "F.Fab")
      (effects (font (size 1 1) (thickness 0.15)))
      (tstamp e76ec524-408a-4daa-89f6-0edfdbcfb621)
    )
    (fp_text user "K" (at 0 -1.8 90) (layer "F.SilkS")
      (effects (font (size 1 1) (thickness 0.15)))
      (tstamp eb473bfd-fc2d-4cf0-8714-6b7dd95b0a03)
    )
    (fp_text user "${REFERENCE}" (at 4.11 0 90) (layer "F.Fab")
      (effects (font (size 0.8 0.8) (thickness 0.12)))
      (tstamp fa20e708-ec85-4e0b-8402-f74a2724f920)
    )
    (fp_text user "K" (at 0 -1.8 90) (layer "F.Fab")
      (effects (font (size 1 1) (thickness 0.15)))
      (tstamp fb35e3b1-aff6-41a7-9cf0-52694b95edeb)
    )
    (fp_line (start 5.93 1.12) (end 5.93 -1.12) (layer "F.SilkS") (width 0.12) (tstamp 015f5586-ba76-4a98-9114-f5cd2c67134d))
    (fp_line (start 5.93 -1.12) (end 1.69 -1.12) (layer "F.SilkS") (width 0.12) (tstamp 21492bcd-343a-4b2b-b55a-b4586c11bdeb))
    (fp_line (start 1.69 -1.12) (end 1.69 1.12) (layer "F.SilkS") (width 0.12) (tstamp 2f424da3-8fae-4941-bc6d-20044787372f))
    (fp_line (start 6.58 0) (end 5.93 0) (layer "F.SilkS") (width 0.12) (tstamp 3bca658b-a598-4669-a7cb-3f9b5f47bb5a))
    (fp_line (start 1.69 1.12) (end 5.93 1.12) (layer "F.SilkS") (width 0.12) (tstamp 41485de5-6ed3-4c83-b69e-ef83ae18093c))
    (fp_line (start 2.29 -1.12) (end 2.29 1.12) (layer "F.SilkS") (width 0.12) (tstamp 46cbe85d-ff47-428e-b187-4ebd50a66e0c))
    (fp_line (start 2.53 -1.12) (end 2.53 1.12) (layer "F.SilkS") (width 0.12) (tstamp 541721d1-074b-496e-a833-813044b3e8ca))
    (fp_line (start 2.41 -1.12) (end 2.41 1.12) (layer "F.SilkS") (width 0.12) (tstamp 96315415-cfed-47d2-b3dd-d782358bd0df))
    (fp_line (start 1.04 0) (end 1.69 0) (layer "F.SilkS") (width 0.12) (tstamp d05faa1f-5f69-41bf-86d3-2cd224432e1b))
    (fp_line (start -1.05 -1.25) (end -1.05 1.25) (layer "F.CrtYd") (width 0.05) (tstamp 42d3f9d6-2a47-41a8-b942-295fcb83bcd8))
    (fp_line (start -1.05 1.25) (end 8.67 1.25) (layer "F.CrtYd") (width 0.05) (tstamp b7aa0362-7c9e-4a42-b191-ab15a38bf3c5))
    (fp_line (start 8.67 -1.25) (end -1.05 -1.25) (layer "F.CrtYd") (width 0.05) (tstamp bef2abc2-bf3e-4a72-ad03-f8da3cd893cb))
    (fp_line (start 8.67 1.25) (end 8.67 -1.25) (layer "F.CrtYd") (width 0.05) (tstamp dd1edfbb-5fb6-42cd-b740-fd54ab3ef1f1))
    (fp_line (start 2.31 -1) (end 2.31 1) (layer "F.Fab") (width 0.1) (tstamp 12fa3c3f-3d14-451a-a6a8-884fd1b32fa7))
    (fp_line (start 0 0) (end 1.81 0) (layer "F.Fab") (width 0.1) (tstamp 1cc5480b-56b7-4379-98e2-ccafc88911a7))
    (fp_line (start 5.81 1) (end 5.81 -1) (layer "F.Fab") (width 0.1) (tstamp 7bea05d4-1dec-4cd6-aa53-302dde803254))
    (fp_line (start 7.62 0) (end 5.81 0) (layer "F.Fab") (width 0.1) (tstamp 851f3d61-ba3b-4e6e-abd4-cafa4d9b64cb))
    (fp_line (start 5.81 -1) (end 1.81 -1) (layer "F.Fab") (width 0.1) (tstamp 9a8ad8bb-d9a9-4b2b-bc88-ea6fd2676d45))
    (fp_line (start 1.81 1) (end 5.81 1) (layer "F.Fab") (width 0.1) (tstamp a5362821-c161-4c7a-a00c-40e1d7472d56))
    (fp_line (start 1.81 -1) (end 1.81 1) (layer "F.Fab") (width 0.1) (tstamp ca6e2466-a90a-4dab-be16-b070610e5087))
    (fp_line (start 2.51 -1) (end 2.51 1) (layer "F.Fab") (width 0.1) (tstamp d18f2428-546f-4066-8ffb-7653303685db))
    (fp_line (start 2.41 -1) (end 2.41 1) (layer "F.Fab") (width 0.1) (tstamp d95c6650-fcd9-4184-97fe-fde43ea5c0cd))
    (pad "1" thru_hole rect (at 0 0 270) (size 1.6 1.6) (drill 0.8) (layers *.Cu *.Mask)
      (net 51 "Net-(D1-Pad1)") (pinfunction "K") (pintype "passive") (tstamp bc3b3f93-69e0-44a5-b919-319b81d13095))
    (pad "2" thru_hole oval (at 7.62 0 270) (size 1.6 1.6) (drill 0.8) (layers *.Cu *.Mask)
      (net 1 "+5V") (pinfunction "A") (pintype "passive") (tstamp 8aeae536-fd36-430e-be47-1a856eced2fc))
    (model "${KICAD6_3DMODEL_DIR}/Diode_THT.3dshapes/D_DO-35_SOD27_P7.62mm_Horizontal.wrl"
      (offset (xyz 0 0 0))
      (scale (xyz 1 1 1))
      (rotate (xyz 0 0 0))
    )
  )

  (footprint "Connector_PinHeader_2.54mm:PinHeader_1x02_P2.54mm_Vertical" (layer "F.Cu")
    (tedit 59FED5CC) (tstamp fe431a80-868e-482d-aa91-c96eb8387d6a)
    (at 68.609408 86.340394 180)
    (descr "Through hole straight pin header, 1x02, 2.54mm pitch, single row")
    (tags "Through hole pin header THT 1x02 2.54mm single row")
    (property "Sheetfile" "wordclock.kicad_sch")
    (property "Sheetname" "")
    (path "/57dfde8d-880d-4ac6-a375-2d6b2498dd46")
    (attr through_hole)
    (fp_text reference "D2" (at 0 -2.33) (layer "F.SilkS")
      (effects (font (size 1 1) (thickness 0.15)))
      (tstamp d6dc2e2a-2848-4d36-891e-5006a21a96bf)
    )
    (fp_text value "EVL ALS-PDIC144" (at -3.290592 -1.759606 90) (layer "F.Fab")
      (effects (font (size 1 1) (thickness 0.15)))
      (tstamp fff34b63-f9ca-49b5-8ad5-f92410864411)
    )
    (fp_text user "${REFERENCE}" (at 0 1.27 90) (layer "F.Fab")
      (effects (font (size 1 1) (thickness 0.15)))
      (tstamp 05689d2f-cd22-43d5-af77-23d23536e452)
    )
    (fp_line (start -1.33 1.27) (end 1.33 1.27) (layer "F.SilkS") (width 0.12) (tstamp 4e96d57c-c828-4d40-a73a-73020df795a8))
    (fp_line (start -1.33 -1.33) (end 0 -1.33) (layer "F.SilkS") (width 0.12) (tstamp 6602c3a8-0728-4e1d-915f-fecf5ab4b79e))
    (fp_line (start 1.33 1.27) (end 1.33 3.87) (layer "F.SilkS") (width 0.12) (tstamp 6d160d86-e88b-411d-9fb7-9506d99c7627))
    (fp_line (start -1.33 0) (end -1.33 -1.33) (layer "F.SilkS") (width 0.12) (tstamp 78a53743-57ec-4304-a53d-e001801cbcad))
    (fp_line (start -1.33 3.87) (end 1.33 3.87) (layer "F.SilkS") (width 0.12) (tstamp a0503b5b-f192-42b1-bfdb-62d55ef394ed))
    (fp_line (start -1.33 1.27) (end -1.33 3.87) (layer "F.SilkS") (width 0.12) (tstamp f85b90f6-cb1e-4315-8897-9cf16bbe1746))
    (fp_line (start -1.8 4.35) (end 1.8 4.35) (layer "F.CrtYd") (width 0.05) (tstamp 3143988a-5124-42ba-89fb-d9510e44a22a))
    (fp_line (start 1.8 4.35) (end 1.8 -1.8) (layer "F.CrtYd") (width 0.05) (tstamp 70638a3c-a6e7-44e2-a618-6abc3dc52d59))
    (fp_line (start 1.8 -1.8) (end -1.8 -1.8) (layer "F.CrtYd") (width 0.05) (tstamp c62eef2a-7ef2-40c7-b840-d925cad4507e))
    (fp_line (start -1.8 -1.8) (end -1.8 4.35) (layer "F.CrtYd") (width 0.05) (tstamp ca2d31dd-a36c-4d19-900d-8671e24e5611))
    (fp_line (start -1.27 -0.635) (end -0.635 -1.27) (layer "F.Fab") (width 0.1) (tstamp 0a928a2d-d770-4b09-a20e-48c2e81982fb))
    (fp_line (start 1.27 3.81) (end -1.27 3.81) (layer "F.Fab") (width 0.1) (tstamp 514acc2d-3e7a-456c-ad5c-4f9932cadca8))
    (fp_line (start -0.635 -1.27) (end 1.27 -1.27) (layer "F.Fab") (width 0.1) (tstamp 63aa1c14-dad1-43aa-a69d-137d69803387))
    (fp_line (start -1.27 3.81) (end -1.27 -0.635) (layer "F.Fab") (width 0.1) (tstamp b7ba2207-3d21-453c-9962-275adb6c5f93))
    (fp_line (start 1.27 -1.27) (end 1.27 3.81) (layer "F.Fab") (width 0.1) (tstamp bd16b041-6f3b-4e6d-8621-0d5fb9a07365))
    (pad "1" thru_hole rect (at 0 0 180) (size 1.7 1.7) (drill 1) (layers *.Cu *.Mask)
      (net 50 "Net-(D2-Pad1)") (pinfunction "K") (pintype "passive") (tstamp 75926d66-4335-4a1d-90b5-2048e56449d0))
    (pad "2" thru_hole oval (at 0 2.54 180) (size 1.7 1.7) (drill 1) (layers *.Cu *.Mask)
      (net 34 "+3.3V") (pinfunction "A") (pintype "passive") (tstamp bad5e7ce-f3be-49ad-822a-6410c6b5e0fa))
    (model "${KICAD6_3DMODEL_DIR}/Connector_PinHeader_2.54mm.3dshapes/PinHeader_1x02_P2.54mm_Vertical.wrl"
      (offset (xyz 0 0 0))
      (scale (xyz 1 1 1))
      (rotate (xyz 0 0 0))
    )
  )

  (gr_rect (start 51.310367 27.989958) (end 73.310367 120.494459) (layer "Edge.Cuts") (width 0.1) (fill none) (tstamp 9ab92207-1da7-4613-a632-d3972813f57b))

  (segment (start 63.620084 116.766992) (end 68.603198 111.783878) (width 0.25) (layer "B.Cu") (net 1) (tstamp 1356934c-28b9-4e9c-be61-b6e973ebc4c3))
  (segment (start 68.61984 99.09984) (end 66.019765 99.09984) (width 0.25) (layer "B.Cu") (net 1) (tstamp 2d25998c-999a-4270-80ac-c6492ffd3107))
  (segment (start 71.12 101.6) (end 68.61984 99.09984) (width 0.25) (layer "B.Cu") (net 1) (tstamp 41005143-7b56-431a-aa2b-7e8581b9cfa4))
  (segment (start 68.603198 111.783878) (end 71.12 109.267076) (width 0.25) (layer "B.Cu") (net 1) (tstamp 6226d2fe-acd2-4245-b381-5ae6e7dedaa2))
  (segment (start 63.488478 116.766992) (end 63.620084 116.766992) (width 0.25) (layer "B.Cu") (net 1) (tstamp 978fe397-985f-414e-9411-eff038c4cc65))
  (segment (start 71.12 109.267076) (end 71.12 101.6) (width 0.25) (layer "B.Cu") (net 1) (tstamp 9dc20cb5-c245-47e7-b8a2-19055e627f32))
  (segment (start 56.342784 86.654575) (end 56.342784 86.191791) (width 0.25) (layer "B.Cu") (net 2) (tstamp 3a05f65d-69b6-4e6c-9ce8-4b6b36acfa2b))
  (segment (start 60.96 91.44) (end 55.860394 86.340394) (width 0.25) (layer "B.Cu") (net 2) (tstamp 78592f47-d6f5-4765-824d-af895a814b01))
  (segment (start 55.900234 101.639211) (end 53.4 99.138977) (width 0.25) (layer "B.Cu") (net 3) (tstamp 1f6bdb3a-fbe8-47cf-8e11-ec367c93141b))
  (segment (start 55.5 75.658708) (end 53.462588 73.621296) (width 0.25) (layer "B.Cu") (net 3) (tstamp 219f3225-cc73-45b4-907c-2655b20cc1e7))
  (segment (start 62.2 115.51547) (end 62.2 108.027076) (width 0.25) (layer "B.Cu") (net 3) (tstamp 2ffec381-d997-4ec3-8a89-938b7b1ff4b7))
  (segment (start 53.363198 104.163878) (end 55.887865 101.639211) (width 0.25) (layer "B.Cu") (net 3) (tstamp 327cff90-27d6-493f-b9ca-62c6fa46b1dd))
  (segment (start 53.4 83.3) (end 55.5 81.2) (width 0.25) (layer "B.Cu") (net 3) (tstamp 6f460adc-d979-4b59-9d32-9b5e185541a0))
  (segment (start 55.887865 101.639211) (end 55.900234 101.639211) (width 0.25) (layer "B.Cu") (net 3) (tstamp 7c916b60-47a4-42fc-9b08-ac861e2a2005))
  (segment (start 57.226396 108.027076) (end 62.2 108.027076) (width 0.25) (layer "B.Cu") (net 3) (tstamp 80bf9913-e920-489d-871f-13d60e97e6c5))
  (segment (start 53.4 99.138977) (end 53.4 83.3) (width 0.25) (layer "B.Cu") (net 3) (tstamp 8a4e3b86-87d3-4cfc-84a0-1a075cc79440))
  (segment (start 62.2 108.027076) (end 66.063198 104.163878) (width 0.25) (layer "B.Cu") (net 3) (tstamp 9e39da0c-55ac-4777-8741-afae6ed1a642))
  (segment (start 55.5 81.2) (end 55.5 75.658708) (width 0.25) (layer "B.Cu") (net 3) (tstamp c411d3f0-236c-4aef-af7b-7261c26d8b24))
  (segment (start 60.948478 116.766992) (end 62.2 115.51547) (width 0.25) (layer "B.Cu") (net 3) (tstamp e8a268be-3e79-4137-b6e0-0b86b5fd68b6))
  (segment (start 53.363198 104.163878) (end 57.226396 108.027076) (width 0.25) (layer "B.Cu") (net 3) (tstamp fdd7c921-6762-400c-b95b-67325b144a1d))
  (segment (start 54.77161 68.541296) (end 53.462588 68.541296) (width 0.25) (layer "B.Cu") (net 17) (tstamp 2147b0e9-4157-475e-a4fa-e239b366dd1e))
  (segment (start 63.527099 81.252901) (end 63.527099 77.296785) (width 0.25) (layer "B.Cu") (net 17) (tstamp 4bce6e8a-eca8-467c-ad88-a31c55312c30))
  (segment (start 63.5 101.6) (end 63.5 81.28) (width 0.25) (layer "B.Cu") (net 17) (tstamp 65b1fbaa-8a09-4983-8bd4-2ac52012db8d))
  (segment (start 63.527099 77.296785) (end 54.77161 68.541296) (width 0.25) (layer "B.Cu") (net 17) (tstamp 7d1582ff-f67d-4920-aed3-aeea5dce8386))
  (segment (start 66.03932 101.6) (end 63.5 101.6) (width 0.25) (layer "B.Cu") (net 17) (tstamp 8a1d6cd0-19bc-4b04-bd54-06216b0d03b9))
  (segment (start 68.603198 104.163878) (end 66.03932 101.6) (width 0.25) (layer "B.Cu") (net 17) (tstamp a25163fe-bb6d-4a2f-9f14-6c1a7d0c693c))
  (segment (start 63.5 81.28) (end 63.527099 81.252901) (width 0.25) (layer "B.Cu") (net 17) (tstamp a75bcd75-7fc0-4abe-9e6e-12c7bb6effce))
  (segment (start 68.609408 43.234476) (end 71.242588 40.601296) (width 0.25) (layer "B.Cu") (net 34) (tstamp ab78a1be-ef5a-44a9-959f-13c7b6f266dc))
  (segment (start 68.609408 83.800394) (end 68.609408 43.234476) (width 0.25) (layer "B.Cu") (net 34) (tstamp dc098ed2-8525-46c3-8b04-da6893f46a66))
  (segment (start 68.2 89.3) (end 57.6 89.3) (width 0.25) (layer "F.Cu") (net 50) (tstamp 34fde79c-bebe-40fd-a6ad-bcc8ff7cfa37))
  (segment (start 57.6 89.3) (end 57.4 89.5) (width 0.25) (layer "F.Cu") (net 50) (tstamp cf208979-0ffa-4bb3-adfa-7185fa632dea))
  (via (at 57.4 89.5) (size 0.8) (drill 0.4) (layers "F.Cu" "B.Cu") (net 50) (tstamp 8e6d284b-3b07-4d1c-831b-96db52ddd4a8))
  (via (at 68.2 89.3) (size 0.8) (drill 0.4) (layers "F.Cu" "B.Cu") (net 50) (tstamp da4ae200-fa3d-4779-bf18-86ba4fb9c76a))
  (segment (start 57.4 89.979445) (end 57.4 89.5) (width 0.25) (layer "B.Cu") (net 50) (tstamp 5d0d0933-692a-45ce-9791-7e4ad873a11a))
  (segment (start 70.068077 84.881725) (end 70.068077 54.475807) (width 0.25) (layer "B.Cu") (net 50) (tstamp 6d9b1d01-58d2-4ed4-ad74-1f0b59d07fc9))
  (segment (start 70.068077 54.475807) (end 71.242588 53.301296) (width 0.25) (layer "B.Cu") (net 50) (tstamp 7e924495-e82b-4210-b16a-4e8fce0906f6))
  (segment (start 68.609408 86.340394) (end 68.609408 88.890592) (width 0.25) (layer "B.Cu") (net 50) (tstamp 90619938-2c44-45fc-8047-28a0dfa90de6))
  (segment (start 68.609408 86.340394) (end 70.068077 84.881725) (width 0.25) (layer "B.Cu") (net 50) (tstamp ddb3bebe-ce99-41c7-bc22-9aa3a5a45cf0))
  (segment (start 55.900234 91.479211) (end 57.4 89.979445) (width 0.25) (layer "B.Cu") (net 50) (tstamp fabb2e45-e316-4fa0-b41e-95eeeb6bce42))
  (segment (start 68.609408 88.890592) (end 68.2 89.3) (width 0.25) (layer "B.Cu") (net 50) (tstamp ff6bbf15-5fb4-4cec-ae3a-b1765de05c3e))
  (segment (start 66.019765 91.460235) (end 66.04 91.44) (width 0.25) (layer "B.Cu") (net 51) (tstamp 4090fed5-5d17-4426-b3dc-35041d1d13d0))
  (segment (start 66.019765 91.47984) (end 66.019765 91.460235) (width 0.25) (layer "B.Cu") (net 51) (tstamp 4094da57-fff5-406f-a4dc-320cf86db75a))
  (segment (start 66.019765 91.47984) (end 66.067099 91.432506) (width 0.25) (layer "B.Cu") (net 51) (tstamp 4fe49f6f-706d-401b-afcd-39bdbe5bd6b6))
  (segment (start 66.067099 91.432506) (end 66.067099 38.156785) (width 0.25) (layer "B.Cu") (net 51) (tstamp 5c67f752-f82d-4d03-8e23-e2fa9631d27a))
  (segment (start 66.067099 38.156785) (end 71.242588 32.981296) (width 0.25) (layer "B.Cu") (net 51) (tstamp d232536a-d6c5-4515-857c-4cac13de3fba))
  (segment (start 63.523198 104.163878) (end 60.96 101.60068) (width 0.25) (layer "B.Cu") (net 53) (tstamp e1ce6352-4c37-41fc-ba3d-1caeea39a49c))

)
