^D:\LABS\MYPROJECTS\MY_FIRST3DGAME\MY_FIRST3DGAME\X64\RELEASE\MY_FIRST3DGAME.OBJ
C:\PROGRAM FILES (X86)\WINDOWS KITS\10\LIB\10.0.19041.0\UM\X64\KERNEL32.LIB
C:\PROGRAM FILES (X86)\WINDOWS KITS\10\LIB\10.0.19041.0\UM\X64\USER32.LIB
C:\PROGRAM FILES (X86)\WINDOWS KITS\10\LIB\10.0.19041.0\UM\X64\GDI32.LIB
C:\PROGRAM FILES (X86)\WINDOWS KITS\10\LIB\10.0.19041.0\UM\X64\WINSPOOL.LIB
C:\PROGRAM FILES (X86)\WINDOWS KITS\10\LIB\10.0.19041.0\UM\X64\COMDLG32.LIB
C:\PROGRAM FILES (X86)\WINDOWS KITS\10\LIB\10.0.19041.0\UM\X64\ADVAPI32.LIB
C:\PROGRAM FILES (X86)\WINDOWS KITS\10\LIB\10.0.19041.0\UM\X64\SHELL32.LIB
C:\PROGRAM FILES (X86)\WINDOWS KITS\10\LIB\10.0.19041.0\UM\X64\OLE32.LIB
C:\PROGRAM FILES (X86)\WINDOWS KITS\10\LIB\10.0.19041.0\UM\X64\OLEAUT32.LIB
C:\PROGRAM FILES (X86)\WINDOWS KITS\10\LIB\10.0.19041.0\UM\X64\UUID.LIB
C:\PROGRAM FILES (X86)\WINDOWS KITS\10\LIB\10.0.19041.0\UM\X64\ODBC32.LIB
C:\PROGRAM FILES (X86)\WINDOWS KITS\10\LIB\10.0.19041.0\UM\X64\ODBCCP32.LIB
D:\LABS\MYPROJECTS\MY_FIRST3DGAME\MY_FIRST3DGAME\X64\RELEASE\MY_FIRST3DGAME.OBJ
C:\WINDOWS\GLOBALIZATION\SORTING\SORTDEFAULT.NLS
D:\PROGRAMS\VISUALSTUDIO\VC\TOOLS\MSVC\14.33.31629\BIN\HOSTX64\X64\C2.DLL
D:\PROGRAMS\VISUALSTUDIO\VC\TOOLS\MSVC\14.33.31629\LIB\X64\MSVCPRT.LIB
D:\PROGRAMS\VISUALSTUDIO\VC\TOOLS\MSVC\14.33.31629\LIB\X64\MSVCRT.LIB
D:\PROGRAMS\VISUALSTUDIO\VC\TOOLS\MSVC\14.33.31629\LIB\X64\OLDNAMES.LIB
D:\PROGRAMS\VISUALSTUDIO\VC\TOOLS\MSVC\14.33.31629\LIB\X64\VCRUNTIME.LIB
C:\PROGRAM FILES (X86)\WINDOWS KITS\10\LIB\10.0.19041.0\UCRT\X64\UCRT.LIB
D:\PROGRAMS\VISUALSTUDIO\VC\TOOLS\MSVC\14.33.31629\BIN\HOSTX64\X64\1049\LINKUI.DLL
D:\PROGRAMS\VISUALSTUDIO\VC\TOOLS\MSVC\14.33.31629\BIN\HOSTX64\X64\CVTRES.EXE
C:\WINDOWS\SYSTEM32\TZRES.DLL
D:\LABS\MYPROJECTS\MY_FIRST3DGAME\MY_FIRST3DGAME\X64\RELEASE\VC143.PDB
