^D:\LABS\BETALABS\KODE_TEST_EXERCISE\X64\DEBUG\KODE_TEST_EXERCISE.OBJ
/OUT:"D:\LABS\BETALABS\KODE_TEST_EXERCISE\X64\DEBUG\KODE_TEST_EXERCISE.EXE" /INCREMENTAL /ILK:"X64\DEBUG\KODE_TEST_EXERCISE.ILK" /NOLOGO KERNEL32.LIB USER32.LIB GDI32.LIB WINSPOOL.LIB COMDLG32.LIB ADVAPI32.LIB SHELL32.LIB OLE32.LIB OLEAUT32.LIB UUID.LIB ODBC32.LIB ODBCCP32.LIB /MANIFEST /MANIFESTUAC:"level='asInvoker' uiAccess='false'" /manifest:embed /DEBUG /PDB:"D:\LABS\BETALABS\KODE_TEST_EXERCISE\X64\DEBUG\KODE_TEST_EXERCISE.PDB" /SUBSYSTEM:CONSOLE /TLBID:1 /DYNAMICBASE /NXCOMPAT /IMPLIB:"D:\LABS\BETALABS\KODE_TEST_EXERCISE\X64\DEBUG\KODE_TEST_EXERCISE.LIB" /MACHINE:X64 X64\DEBUG\KODE_TEST_EXERCISE.OBJ
^D:\LABS\BETALABS\KODE_TEST_EXERCISE\X64\DEBUG\FILEMANAGER.OBJ|D:\LABS\BETALABS\KODE_TEST_EXERCISE\X64\DEBUG\KODE_TEST_EXERCISE.OBJ|D:\LABS\BETALABS\KODE_TEST_EXERCISE\X64\DEBUG\LIST.OBJ|D:\LABS\BETALABS\KODE_TEST_EXERCISE\X64\DEBUG\LISTOBJECT.OBJ
/OUT:"D:\LABS\BETALABS\KODE_TEST_EXERCISE\X64\DEBUG\KODE_TEST_EXERCISE.EXE" /INCREMENTAL /ILK:"X64\DEBUG\KODE_TEST_EXERCISE.ILK" /NOLOGO KERNEL32.LIB USER32.LIB GDI32.LIB WINSPOOL.LIB COMDLG32.LIB ADVAPI32.LIB SHELL32.LIB OLE32.LIB OLEAUT32.LIB UUID.LIB ODBC32.LIB ODBCCP32.LIB /MANIFEST /MANIFESTUAC:"level='asInvoker' uiAccess='false'" /manifest:embed /DEBUG /PDB:"D:\LABS\BETALABS\KODE_TEST_EXERCISE\X64\DEBUG\KODE_TEST_EXERCISE.PDB" /SUBSYSTEM:CONSOLE /TLBID:1 /DYNAMICBASE /NXCOMPAT /IMPLIB:"D:\LABS\BETALABS\KODE_TEST_EXERCISE\X64\DEBUG\KODE_TEST_EXERCISE.LIB" /MACHINE:X64 X64\DEBUG\FILEMANAGER.OBJ
X64\DEBUG\KODE_TEST_EXERCISE.OBJ
X64\DEBUG\LIST.OBJ
X64\DEBUG\LISTOBJECT.OBJ
^D:\LABS\KODE-TEST-EXERCISE\KODE_TEST_EXERCISE\X64\DEBUG\FILEMANAGER.OBJ|D:\LABS\KODE-TEST-EXERCISE\KODE_TEST_EXERCISE\X64\DEBUG\KODE_TEST_EXERCISE.OBJ|D:\LABS\KODE-TEST-EXERCISE\KODE_TEST_EXERCISE\X64\DEBUG\LIST.OBJ|D:\LABS\KODE-TEST-EXERCISE\KODE_TEST_EXERCISE\X64\DEBUG\LISTOBJECT.OBJ
/OUT:"D:\LABS\KODE-TEST-EXERCISE\KODE_TEST_EXERCISE\X64\DEBUG\KODE_TEST_EXERCISE.EXE" /INCREMENTAL /ILK:"X64\DEBUG\KODE_TEST_EXERCISE.ILK" /NOLOGO KERNEL32.LIB USER32.LIB GDI32.LIB WINSPOOL.LIB COMDLG32.LIB ADVAPI32.LIB SHELL32.LIB OLE32.LIB OLEAUT32.LIB UUID.LIB ODBC32.LIB ODBCCP32.LIB /MANIFEST /MANIFESTUAC:"level='asInvoker' uiAccess='false'" /manifest:embed /DEBUG /PDB:"D:\LABS\KODE-TEST-EXERCISE\KODE_TEST_EXERCISE\X64\DEBUG\KODE_TEST_EXERCISE.PDB" /SUBSYSTEM:CONSOLE /TLBID:1 /DYNAMICBASE /NXCOMPAT /IMPLIB:"D:\LABS\KODE-TEST-EXERCISE\KODE_TEST_EXERCISE\X64\DEBUG\KODE_TEST_EXERCISE.LIB" /MACHINE:X64 X64\DEBUG\FILEMANAGER.OBJ
X64\DEBUG\KODE_TEST_EXERCISE.OBJ
X64\DEBUG\LIST.OBJ
X64\DEBUG\LISTOBJECT.OBJ
