{
  "routes": [
    {
      "method": "GET",
      "path": "/api/partners",
      "handler": "Partners.find",
      "config": {
        "policies": []
      }
    },
    {
      "method": "GET",
      "path": "/api/partners/count",
      "handler": "Partners.count",
      "config": {
        "policies": []
      }
    },
    {
      "method": "GET",
      "path": "/api/partners/:_id",
      "handler": "Partners.findOne",
      "config": {
        "policies": []
      }
    },
    {
      "method": "POST",
      "path": "/api/partners",
      "handler": "Partners.create",
      "config": {
        "policies": []
      }
    },
    {
      "method": "PUT",
      "path": "/api/partners/:_id",
      "handler": "Partners.update",
      "config": {
        "policies": []
      }
    },
    {
      "method": "DELETE",
      "path": "/api/partners/:_id",
      "handler": "Partners.destroy",
      "config": {
        "policies": []
      }
    }
  ]
}