{
  "routes": [
    {
      "method": "GET",
      "path": "/api/news",
      "handler": "News.find",
      "config": {
        "policies": []
      }
    },
    {
      "method": "GET",
      "path": "/api/news/count",
      "handler": "News.count",
      "config": {
        "policies": []
      }
    },
    {
      "method": "GET",
      "path": "/api/news/:_id",
      "handler": "News.findOne",
      "config": {
        "policies": []
      }
    },
    {
      "method": "POST",
      "path": "/api/news",
      "handler": "News.create",
      "config": {
        "policies": []
      }
    },
    {
      "method": "PUT",
      "path": "/api/news/:_id",
      "handler": "News.update",
      "config": {
        "policies": []
      }
    },
    {
      "method": "DELETE",
      "path": "/api/news/:_id",
      "handler": "News.destroy",
      "config": {
        "policies": []
      }
    }
  ]
}
