{
  "routes": [
    {
      "method": "GET",
      "path": "/api/probes",
      "handler": "Probes.find",
      "config": {
        "policies": []
      }
    },
    {
      "method": "GET",
      "path": "/api/probes/count",
      "handler": "Probes.count",
      "config": {
        "policies": []
      }
    },
    {
      "method": "GET",
      "path": "/api/probes/:_id",
      "handler": "Probes.findOne",
      "config": {
        "policies": []
      }
    },
    {
      "method": "POST",
      "path": "/api/probes",
      "handler": "Probes.create",
      "config": {
        "policies": []
      }
    },
    {
      "method": "PUT",
      "path": "/api/probes/:_id",
      "handler": "Probes.update",
      "config": {
        "policies": []
      }
    },
    {
      "method": "DELETE",
      "path": "/api/probes/:_id",
      "handler": "Probes.destroy",
      "config": {
        "policies": []
      }
    }
  ]
}