{
  "connection": "default",
  "collectionName": "brands",
  "info": {
    "name": "brands",
    "description": ""
  },
  "options": {
    "timestamps": true
  },
  "attributes": {
    "name_en": {
      "type": "string"
    },
    "name_hy": {
      "type": "string"
    },
    "name_ru": {
      "type": "string"
    },
    "long_name_en": {
      "type": "string"
    },
    "long_name_hy": {
      "type": "string"
    },
    "long_name_ru": {
      "type": "string"
    },
    "description_en": {
      "type": "string"
    },
    "description_hy": {
      "type": "string"
    },
    "description_ru": {
      "type": "string"
    },
    "image": {
      "model": "file",
      "via": "related",
      "plugin": "upload"
    },
    "products": {
      "collection": "products",
      "via": "brand"
    }
  }
}