{
  "routes": [
    {
      "method": "GET",
      "path": "/api/softwares",
      "handler": "Software.find",
      "config": {
        "policies": []
      }
    },
    {
      "method": "GET",
      "path": "/api/softwares/count",
      "handler": "Software.count",
      "config": {
        "policies": []
      }
    },
    {
      "method": "GET",
      "path": "/api/softwares/:_id",
      "handler": "Software.findOne",
      "config": {
        "policies": []
      }
    },
    {
      "method": "POST",
      "path": "/api/softwares",
      "handler": "Software.create",
      "config": {
        "policies": []
      }
    },
    {
      "method": "PUT",
      "path": "/api/softwares/:_id",
      "handler": "Software.update",
      "config": {
        "policies": []
      }
    },
    {
      "method": "DELETE",
      "path": "/api/softwares/:_id",
      "handler": "Software.destroy",
      "config": {
        "policies": []
      }
    }
  ]
}