211226_023845     5.357 Rx FT8    -15  0.2 1042 WK2M ON7GB -09
211226_023845     5.357 Rx FT8    -13  0.2  757 HV0A K6EID -14
211226_023845     5.357 Rx FT8    -14  0.2  250 HV0A K4NCO EM74
211226_023845     5.357 Rx FT8    -16  0.1  700 HV0A KN4RNO EM73
211226_023900     5.357 Rx FT8      0  0.3 1328 HV0A CO3DK -14
211226_023900     5.357 Rx FT8     -8  0.3 1391 K4NCO HP2NG -16
211226_023900     5.357 Rx FT8     -5  0.8 1742 PC2F WP3UX FK68
211226_023900     5.357 Rx FT8      5  0.2 2007 EA2DLX W7DO -11
211226_023900     5.357 Rx FT8    -13  0.1  939 NJ8J 9Y4DG RR73
211226_023900     5.357 Rx FT8    -10  0.3  623 WX2S VE3OTL R-04
