"","MeanDecreaseGini"
"V1",4.88231163882611
"V2",5.77138636078944
"V3",6.52054728767637
"V4",7.91061341735337
"V5",7.16715125893069
"V6",7.31282985061549
"V7",8.26756595431289
"V8",11.2628869647687
"V9",11.294636358006
"V10",9.62746378136479
"V11",8.89808585062222
"V12",8.20193252886796
"V13",6.34902605860362
"V14",6.34070764061717
"V15",7.66238476542313
"V16",8.78725012238989
"V17",3.15257947941385
"V18",4.70309839738647
"V19",4.16727213207694
"V20",4.32505265568051
"V21",3.45508104332983
"V22",3.61860679579661
"V23",4.4288850493133
"V24",3.81476764481014
"V25",4.1316305058591
"V26",3.20423278589936
"V27",3.40911811358943
"V28",2.70772541511058
"V29",2.58522596912373
"V30",3.18560442152701
"V31",5.09752274058903
"V32",2.76225129704022
"V33",3.2703760044498
"V34",4.45760694765127
"V35",5.80476085367559
"V36",4.38389111289468
"V37",4.43916081704683
"V38",4.29629493915217
"V39",3.82655203629301
"V40",3.12665549555366
"V41",3.21980122228107
"V42",3.13367537282232
"V43",3.31918365772573
"V44",4.09229261013891
"V45",5.41108367816032
"V46",6.83770101295024
"V47",13.1430922029764
"V48",6.75024572939201
"V49",2.67478330492808
"V50",7.88363964055944
"V51",4.77087878112882
"V52",4.32411902009938
"V53",4.34619632317166
"V54",3.52467718543216
"V55",2.88292630982412
"V56",2.75847405517442
"V57",3.33229493037104
"V58",3.34902666906805
"V59",4.27466710402404
"V60",6.93461216621113
"V61",7.19060445462479
"V62",9.90401315269041
"V63",16.3579871049761
"V64",6.0814266048727
"V65",6.34704642035826
"V66",14.0253191064091
"V67",7.03220719192878
"V68",4.98426743057456
"V69",4.78607827428764
"V70",4.15803074601008
"V71",3.52938930386917
"V72",3.17208313045931
"V73",3.7507161119233
"V74",4.92556356434145
"V75",6.71993733769285
"V76",7.04598613363038
"V77",10.8603495128137
"V78",9.81163012016185
"V79",15.5151900417756
"V80",7.54386100917256
"V81",6.22833040978304
"V82",14.5358054558895
"V83",7.7140739589954
"V84",4.82429642777803
"V85",4.46009663603209
"V86",4.29303373253539
"V87",3.68659979446141
"V88",3.95554433074239
"V89",5.10809630114701
"V90",4.67623817457371
"V91",5.92423681672346
"V92",6.26098561482489
"V93",10.477301432462
"V94",6.26418603343419
"V95",15.5473321720831
"V96",11.9765645983812
"V97",4.35362768154556
"V98",8.28098939363284
"V99",5.26473146320426
"V100",3.87287067029809
"V101",5.18266665384898
"V102",5.68675585818289
"V103",5.65421315749127
"V104",6.2357161859795
"V105",6.00736607730375
"V106",5.02061819884675
"V107",5.21815473755984
"V108",4.65350499217227
"V109",7.03972120607801
"V110",5.27495101866559
"V111",13.0156226157381
"V112",14.5476900238177
"V113",5.27772072582998
"V114",5.47675251372506
"V115",3.56933850075784
"V116",2.95195353363083
"V117",3.33265207960215
"V118",4.57562005671592
"V119",6.80380943752765
"V120",4.5100838508524
"V121",4.50153507056223
"V122",4.25225793578733
"V123",3.64728526326429
"V124",3.40923984757892
"V125",3.83660063340834
"V126",3.34078472181622
"V127",9.48484043009315
"V128",9.22688025536681
"V129",6.88648238355478
"V130",12.2578290679546
"V131",3.83184990255632
"V132",2.70397324996745
"V133",3.11822336834722
"V134",5.0066958725693
"V135",6.222103211704
"V136",5.27377877590059
"V137",4.54856044605615
"V138",4.40385669052785
"V139",3.7677278550083
"V140",3.33149675671728
"V141",4.60789603185642
"V142",3.79286807606079
"V143",5.90321706580661
"V144",3.31877965567373
"V145",12.5581217052984
"V146",16.5359521543982
"V147",6.1033019339186
"V148",4.00495751951558
"V149",5.11305534084458
"V150",4.51313223427417
"V151",4.05470899373052
"V152",5.20200703962529
"V153",4.07739870899737
"V154",3.48349388482625
"V155",3.46277167435157
"V156",4.12988495414642
"V157",5.09269054125763
"V158",4.83034608599691
"V159",4.76149983309821
"V160",2.60627863186902
"V161",11.2151264511017
"V162",25.2609203649837
"V163",8.31535334914459
"V164",6.25568016190861
"V165",4.62895893492402
"V166",5.13869561996881
"V167",5.07010835352427
"V168",4.16607257587403
"V169",3.64840377213558
"V170",3.08315859086358
"V171",4.00265361232281
"V172",4.0864940172741
"V173",4.81528839532931
"V174",6.49658329451328
"V175",9.9441145367759
"V176",3.18751832173923
"V177",11.2791430488164
"V178",19.5062225282351
"V179",8.95008415735272
"V180",5.27241418489575
"V181",4.21789258061973
"V182",3.93586774390801
"V183",3.67275708622401
"V184",3.22910532686417
"V185",3.25571792234396
"V186",3.16510917155875
"V187",3.88418646505242
"V188",3.88609380911018
"V189",4.61601127950053
"V190",4.27459768751419
"V191",12.9214902878159
"V192",6.22690341214077
"V193",8.4923542591049
"V194",14.3880655948133
"V195",7.59067240650319
"V196",4.24392618137848
"V197",4.15493742483991
"V198",3.1791181436151
"V199",2.62682152070672
"V200",2.39098911647704
"V201",2.74964438018418
"V202",2.57524902592996
"V203",2.34361235399868
"V204",2.84301371237197
"V205",3.62447308318805
"V206",3.86668201918185
"V207",7.10103589509742
"V208",3.2796411916924
"V209",3.71694770621958
"V210",5.64507204333219
"V211",5.18888733515461
"V212",3.70618520509122
"V213",2.87062309741999
"V214",2.94381329883815
"V215",2.14161205654973
"V216",2.56591425897636
"V217",2.30004828862532
"V218",2.04408248961962
"V219",2.22750137465462
"V220",2.78292524321346
"V221",3.127491244313
"V222",3.90519696686051
"V223",2.89008410313275
"V224",1.65826128774558
"V225",2.6634767953677
"V226",4.82410194388521
"V227",5.83035383424557
"V228",9.4079273671441
"V229",11.0411875211756
"V230",11.7534041822616
"V231",11.9154681039711
"V232",10.3867609162349
"V233",5.89604357008205
"V234",6.5433329440679
"V235",6.30188811725286
"V236",5.83859591669534
"V237",5.54933872781593
"V238",6.46011285513023
"V239",4.17035651842347
"V240",2.95152951537968
"V241",1.59437461738537
"V242",1.83941549350012
"V243",2.30809064001311
"V244",3.22291727998187
"V245",4.90522105671805
"V246",5.51470477611752
"V247",4.43120777894219
"V248",3.90167466498355
"V249",2.78437186666349
"V250",2.82321947160355
"V251",2.21080151279363
"V252",1.9771996178032
"V253",2.98828755863041
"V254",2.61396884195818
"V255",2.12361215565187
"V256",0.870744904355489
