<svg width="267" height="87" viewBox="0 0 267 87" fill="none" xmlns="http://www.w3.org/2000/svg">
<path d="M39.9597 25.7152C26.6001 28.3438 20.9033 44.207 29.2648 54.8761C31.9009 58.2415 35.6125 60.6 39.7789 61.557C35.5338 60.7284 31.7018 58.4673 28.9239 55.1521C24.6734 50.1718 23.3396 42.9576 25.4677 36.7599C27.546 30.4363 33.0877 25.4358 39.5982 24L39.9597 25.7152Z" fill="white"/>
<path d="M47.3682 60.6993C60.7279 58.0712 66.4248 42.2074 58.0629 31.5391C55.4271 28.1733 51.7155 25.8147 47.549 24.8576C51.7938 25.6863 55.6255 27.9473 58.4033 31.2623C62.6545 36.2432 63.9883 43.4568 61.8596 49.6547C59.7814 55.9779 54.2397 60.9786 47.7286 62.4146L47.3671 60.6993H47.3682Z" fill="white"/>
<path d="M43.6643 58.0628C51.8688 58.0628 58.5198 51.4117 58.5198 43.2072C58.5198 35.0027 51.8688 28.3517 43.6643 28.3517C35.4598 28.3517 28.8087 35.0027 28.8087 43.2072C28.8087 51.4117 35.4598 58.0628 43.6643 58.0628Z" fill="white"/>
<path d="M79.7848 49.388C77.2269 49.388 75.8939 47.1544 75.8939 43.8039C75.8939 40.4535 77.2269 38.1838 79.7848 38.1838C82.3426 38.1838 83.7116 40.4535 83.7116 43.8039C83.7116 47.1544 82.3426 49.388 79.7848 49.388ZM79.8208 53.5671C85.7652 53.5671 89.656 49.352 89.656 43.8039C89.656 38.2558 85.7652 34.0407 79.8208 34.0407C73.9124 34.0407 69.9495 38.2558 69.9495 43.8039C69.9495 49.352 73.9124 53.5671 79.8208 53.5671ZM90.5603 52.9907H96.4326V42.6511C96.4326 40.4535 97.5134 38.9043 99.3508 38.9043C101.116 38.9043 101.945 40.0572 101.945 42.0386V52.9907H107.817V42.6511C107.817 40.4535 108.862 38.9043 110.735 38.9043C112.5 38.9043 113.329 40.0572 113.329 42.0386V52.9907H119.201V40.9939C119.201 36.8508 117.112 34.0047 112.933 34.0047C110.555 34.0047 108.574 35.0135 107.133 37.2471H107.06C106.124 35.2656 104.286 34.0047 101.873 34.0047C99.2067 34.0047 97.4414 35.2656 96.2885 37.1751H96.1805V34.5451H90.5603V52.9907ZM120.792 52.9907H126.664V42.7952C126.664 40.5255 127.961 38.9043 129.906 38.9043C131.816 38.9043 132.788 40.2373 132.788 42.1827V52.9907H138.661V40.9939C138.661 36.8868 136.283 34.0047 132.248 34.0047C129.69 34.0047 127.925 35.0855 126.556 37.067H126.448V34.5451H120.792V52.9907ZM140.257 52.9907H146.129V34.5451H140.257V52.9907ZM140.257 31.9872H146.129V27.2317H140.257V31.9872ZM152.045 52.9907H157.485L159.683 44.6325C160.079 43.1915 160.512 41.3181 160.512 41.3181H160.584C160.584 41.3181 160.98 43.1915 161.376 44.6325L163.538 52.9907H169.05L174.706 34.5451H168.906L166.852 42.1827C166.456 43.6598 165.988 45.7854 165.988 45.7854H165.916C165.916 45.7854 165.447 43.6598 165.051 42.0747L163.034 34.5451H158.062L156.116 42.0747C155.72 43.6238 155.288 45.7494 155.288 45.7494H155.216C155.216 45.7494 154.783 43.6598 154.387 42.1827L152.37 34.5451H146.389L152.045 52.9907ZM183.305 49.388C180.747 49.388 179.414 47.1544 179.414 43.8039C179.414 40.4535 180.747 38.1838 183.305 38.1838C185.862 38.1838 187.231 40.4535 187.231 43.8039C187.231 47.1544 185.862 49.388 183.305 49.388ZM183.341 53.5671C189.285 53.5671 193.176 49.352 193.176 43.8039C193.176 38.2558 189.285 34.0407 183.341 34.0407C177.432 34.0407 173.469 38.2558 173.469 43.8039C173.469 49.352 177.432 53.5671 183.341 53.5671ZM194.08 52.9907H199.952V44.7046C199.952 40.7056 202.258 38.9403 205.861 39.4447H206.005V34.401C205.753 34.2929 205.392 34.2569 204.852 34.2569C202.618 34.2569 201.105 35.2296 199.808 37.4272H199.7V34.5451H194.08V52.9907ZM206.791 52.9907H212.591V47.3345L214.356 45.4611L218.788 52.9907H225.597L218.355 41.4622L224.84 34.5451H218.067L212.591 40.7777V27.2317H206.791V52.9907ZM233.019 53.5671C237.847 53.5671 241.414 51.4776 241.414 47.4426C241.414 42.7231 237.595 41.8945 234.352 41.3541C232.011 40.9218 229.921 40.7417 229.921 39.4447C229.921 38.2919 231.038 37.7515 232.479 37.7515C234.1 37.7515 235.217 38.2558 235.433 39.9131H240.837C240.549 36.2744 237.739 34.0047 232.515 34.0047C228.156 34.0047 224.553 36.0222 224.553 39.9131C224.553 44.2362 227.976 45.1009 231.182 45.6413C233.632 46.0736 235.866 46.2537 235.866 47.9109C235.866 49.0998 234.749 49.7483 232.983 49.7483C231.038 49.7483 229.813 48.8476 229.597 47.0103H224.049C224.229 51.0813 227.615 53.5671 233.019 53.5671Z" fill="white"/>
</svg>
