<?xml version="1.0" encoding="UTF-8" standalone="no"?>
<svg
   width="442"
   height="520"
   viewBox="0 0 442 520"
   fill="none"
   version="1.1"
   id="svg1"
   xmlns="http://www.w3.org/2000/svg"
   xmlns:svg="http://www.w3.org/2000/svg">
  <defs
     id="defs1" />
  <path
     d="m 428.5,0.5 v 240 c 0,11.598 -9.402,21 -21,21 H 34 c -11.598,0 -21,9.402 -21,21 v 235.79412"
     stroke="#d41a1a"
     stroke-width="26"
     id="path1" />
</svg>
