{
    "key": "group_64e8cd71139fb",
    "title": "Documents & Outils",
    "fields": [
        {
            "key": "field_64e8cd71ff3e4",
            "label": "fichier",
            "name": "fichier",
            "aria-label": "",
            "type": "file",
            "instructions": "",
            "required": 0,
            "conditional_logic": 0,
            "wrapper": {
                "width": "",
                "class": "",
                "id": ""
            },
            "return_format": "url",
            "library": "all",
            "min_size": "",
            "max_size": "",
            "mime_types": ""
        }
    ],
    "location": [
        [
            {
                "param": "post_type",
                "operator": "==",
                "value": "document"
            }
        ],
        [
            {
                "param": "post_type",
                "operator": "==",
                "value": "outil"
            }
        ]
    ],
    "menu_order": 0,
    "position": "acf_after_title",
    "style": "default",
    "label_placement": "top",
    "instruction_placement": "label",
    "hide_on_screen": "",
    "active": true,
    "description": "",
    "show_in_rest": 0,
    "modified": 1697989739
}
