<?xml version="1.0" encoding="UTF-8" standalone="no"?>
<!-- Created with Inkscape (http://www.inkscape.org/) -->

<svg
   xmlns:dc="http://purl.org/dc/elements/1.1/"
   xmlns:cc="http://creativecommons.org/ns#"
   xmlns:rdf="http://www.w3.org/1999/02/22-rdf-syntax-ns#"
   xmlns:svg="http://www.w3.org/2000/svg"
   xmlns="http://www.w3.org/2000/svg"
   xmlns:sodipodi="http://sodipodi.sourceforge.net/DTD/sodipodi-0.dtd"
   xmlns:inkscape="http://www.inkscape.org/namespaces/inkscape"
   width="62.091427mm"
   height="24.664568mm"
   viewBox="0 0 62.091427 24.664568"
   version="1.1"
   id="svg8"
   inkscape:version="0.92.3 (2405546, 2018-03-11)"
   sodipodi:docname="SCAN-5-GUIDELINE.svg">
  <defs
     id="defs2" />
  <sodipodi:namedview
     id="base"
     pagecolor="#ffffff"
     bordercolor="#666666"
     borderopacity="1.0"
     inkscape:pageopacity="0.0"
     inkscape:pageshadow="2"
     inkscape:zoom="4"
     inkscape:cx="96.991457"
     inkscape:cy="30.067874"
     inkscape:document-units="mm"
     inkscape:current-layer="layer4"
     showgrid="false"
     inkscape:window-width="1920"
     inkscape:window-height="1017"
     inkscape:window-x="-8"
     inkscape:window-y="-8"
     inkscape:window-maximized="1"
     fit-margin-top="0"
     fit-margin-left="0"
     fit-margin-right="0"
     fit-margin-bottom="0" />
  <metadata
     id="metadata5">
    <rdf:RDF>
      <cc:Work
         rdf:about="">
        <dc:format>image/svg+xml</dc:format>
        <dc:type
           rdf:resource="http://purl.org/dc/dcmitype/StillImage" />
        <dc:title />
      </cc:Work>
    </rdf:RDF>
  </metadata>
  <g
     inkscape:groupmode="layer"
     id="layer3"
     inkscape:label="PointsRouges"
     transform="translate(-8.8926129,-5.6220918)"
     sodipodi:insensitive="true">
    <ellipse
       id="path28-8-0"
       cx="9.822154"
       cy="21.979656"
       rx="0.87465721"
       ry="0.82092887"
       style="fill:#ff0000;stroke-width:0.0730126" />
    <ellipse
       id="path28-8-0-2"
       cx="16.183168"
       cy="25.53434"
       rx="0.87465721"
       ry="0.82092887"
       style="fill:#ff0000;stroke-width:0.0730126" />
    <ellipse
       id="path28-8-0-2-7"
       cx="21.234564"
       cy="11.970412"
       rx="0.87465721"
       ry="0.82092887"
       style="fill:#ff0000;stroke-width:0.0730126" />
    <ellipse
       id="path28-8-0-2-7-5"
       cx="10.102787"
       cy="11.596234"
       rx="0.87465721"
       ry="0.82092887"
       style="fill:#ff0000;stroke-width:0.0730126" />
    <ellipse
       id="path28-8-0-2-7-5-1"
       cx="16.18317"
       cy="15.712186"
       rx="0.87465721"
       ry="0.82092887"
       style="fill:#ff0000;stroke-width:0.0730126" />
    <ellipse
       id="path28-8-0-2-7-5-1-1"
       cx="24.60216"
       cy="26.843962"
       rx="0.87465721"
       ry="0.82092887"
       style="fill:#ff0000;stroke-width:0.0730126" />
    <ellipse
       id="path28-8-0-2-7-5-1-1-8"
       cx="16.276714"
       cy="7.4802842"
       rx="0.87465721"
       ry="0.82092887"
       style="fill:#ff0000;stroke-width:0.0730126" />
    <ellipse
       id="path28-8-0-2-0"
       cx="32.834061"
       cy="27.21814"
       rx="0.87465721"
       ry="0.82092887"
       style="fill:#ff0000;stroke-width:0.0730126" />
    <ellipse
       id="path28-8-0-2-0-7"
       cx="32.553429"
       cy="18.331427"
       rx="0.87465721"
       ry="0.82092887"
       style="fill:#ff0000;stroke-width:0.0730126" />
    <ellipse
       id="path28-8-0-2-0-7-9"
       cx="32.459885"
       cy="8.0415497"
       rx="0.87465721"
       ry="0.82092887"
       style="fill:#ff0000;stroke-width:0.0730126" />
    <ellipse
       id="path28-8-0-2-0-7-9-2"
       cx="39.849884"
       cy="8.6028156"
       rx="0.87465721"
       ry="0.82092887"
       style="fill:#ff0000;stroke-width:0.0730126" />
    <ellipse
       id="path28-8-0-2-0-7-9-2-8"
       cx="40.036976"
       cy="23.850542"
       rx="0.87465721"
       ry="0.82092887"
       style="fill:#ff0000;stroke-width:0.0730126" />
    <ellipse
       id="path28-8-0-2-0-7-9-2-8-1"
       cx="47.707611"
       cy="24.318264"
       rx="0.87465721"
       ry="0.82092887"
       style="fill:#ff0000;stroke-width:0.0730126" />
    <ellipse
       id="path28-8-0-2-0-7-9-2-8-1-3"
       cx="44.246471"
       cy="18.892693"
       rx="0.87465721"
       ry="0.82092887"
       style="fill:#ff0000;stroke-width:0.0730126" />
    <ellipse
       id="path28-8-0-2-0-7-9-2-8-1-3-2"
       cx="50.701027"
       cy="8.9769936"
       rx="0.87465721"
       ry="0.82092887"
       style="fill:#ff0000;stroke-width:0.0730126" />
    <ellipse
       id="path28-8-0-2-0-7-9-2-8-1-3-2-9"
       cx="51.542927"
       cy="28.808392"
       rx="0.87465721"
       ry="0.82092887"
       style="fill:#ff0000;stroke-width:0.0730126" />
    <ellipse
       id="path28-8-0-2-0-7-9-2-8-1-3-2-9-3"
       cx="61.365082"
       cy="29.18257"
       rx="0.87465721"
       ry="0.82092887"
       style="fill:#ff0000;stroke-width:0.0730126" />
    <ellipse
       id="path28-8-0-2-0-7-9-2-8-1-3-2-9-3-4"
       cx="56.594322"
       cy="24.037632"
       rx="0.87465721"
       ry="0.82092887"
       style="fill:#ff0000;stroke-width:0.0730126" />
    <ellipse
       id="path28-8-0-2-0-7-9-2-8-1-3-2-9-3-4-1"
       cx="61.645714"
       cy="20.950668"
       rx="0.87465721"
       ry="0.82092887"
       style="fill:#ff0000;stroke-width:0.0730126" />
    <ellipse
       id="path28-8-0-2-0-7-9-2-8-1-3-2-9-3-4-1-8"
       cx="55.845966"
       cy="12.905855"
       rx="0.87465721"
       ry="0.82092887"
       style="fill:#ff0000;stroke-width:0.0730126" />
    <ellipse
       id="path28-8-0-2-0-7-9-2-8-1-3-2-9-3-4-1-8-1"
       cx="64.452049"
       cy="9.4447155"
       rx="0.87465721"
       ry="0.82092887"
       style="fill:#ff0000;stroke-width:0.0730126" />
    <ellipse
       id="path28-8-0-2-0-7-9-2-8-1-3-2-9-3-4-1-8-1-6"
       cx="68.193817"
       cy="24.692442"
       rx="0.87465721"
       ry="0.82092887"
       style="fill:#ff0000;stroke-width:0.0730126" />
    <ellipse
       id="path28-8-0-2-7-8"
       cx="27.744175"
       cy="12.82416"
       rx="0.87465721"
       ry="0.82092887"
       style="fill:#ff0000;stroke-width:0.0730126" />
  </g>
  <g
     inkscape:label="PointsNoirs"
     inkscape:groupmode="layer"
     id="layer1"
     transform="translate(-8.8926129,-5.6220918)"
     sodipodi:insensitive="true">
    <ellipse
       id="path28"
       cx="9.7672701"
       cy="8.6562004"
       rx="0.87465721"
       ry="0.82092887"
       style="stroke-width:0.07301259" />
    <ellipse
       id="path28-8"
       cx="9.9189148"
       cy="26.488665"
       rx="0.87465721"
       ry="0.82092887"
       style="stroke-width:0.0730126" />
    <ellipse
       id="path28-8-2"
       cx="21.18"
       cy="8.8851318"
       rx="0.87465727"
       ry="0.82092887"
       style="stroke-width:0.0730126" />
    <ellipse
       id="path28-8-2-5"
       cx="21.438873"
       cy="16.004206"
       rx="0.87465733"
       ry="0.82092887"
       style="stroke-width:0.0730126" />
    <ellipse
       id="path28-8-2-5-9"
       cx="10.048353"
       cy="15.745333"
       rx="0.87465733"
       ry="0.82092887"
       style="stroke-width:0.0730126" />
    <ellipse
       id="path28-8-2-5-9-1"
       cx="21.69775"
       cy="26.747538"
       rx="0.87465733"
       ry="0.82092887"
       style="stroke-width:0.0730126" />
    <ellipse
       id="path28-8-2-5-9-1-7"
       cx="29.075701"
       cy="27.265287"
       rx="0.87465733"
       ry="0.82092887"
       style="stroke-width:0.0730126" />
    <ellipse
       id="path28-8-2-5-9-1-7-8"
       cx="29.075701"
       cy="18.075212"
       rx="0.87465733"
       ry="0.82092887"
       style="stroke-width:0.0730126" />
    <ellipse
       id="path28-8-2-5-9-1-7-8-6"
       cx="28.428511"
       cy="8.4968204"
       rx="0.87465733"
       ry="0.82092887"
       style="stroke-width:0.0730126" />
    <ellipse
       id="path28-8-2-5-9-1-7-8-6-2"
       cx="34.253204"
       cy="12.897703"
       rx="0.87465733"
       ry="0.82092887"
       style="stroke-width:0.0730126" />
    <ellipse
       id="path28-8-2-5-9-1-7-8-6-2-6"
       cx="39.430717"
       cy="19.887339"
       rx="0.87465733"
       ry="0.82092887"
       style="stroke-width:0.0730126" />
    <ellipse
       id="path28-8-2-5-9-1-7-8-6-2-6-1"
       cx="42.796097"
       cy="15.486456"
       rx="0.87465733"
       ry="0.82092887"
       style="stroke-width:0.0730126" />
    <ellipse
       id="path28-8-2-5-9-1-7-8-6-2-6-1-7"
       cx="46.938103"
       cy="8.6262589"
       rx="0.87465733"
       ry="0.82092887"
       style="stroke-width:0.0730126" />
    <ellipse
       id="path28-8-2-5-9-1-7-8-6-2-6-1-7-8"
       cx="47.973602"
       cy="28.818544"
       rx="0.87465733"
       ry="0.82092887"
       style="stroke-width:0.0730126" />
    <ellipse
       id="path28-8-2-5-9-1-7-8-6-2-6-1-7-8-9"
       cx="55.739864"
       cy="29.206854"
       rx="0.87465733"
       ry="0.82092887"
       style="stroke-width:0.0730126" />
    <ellipse
       id="path28-8-2-5-9-1-7-8-6-2-6-1-7-8-9-1"
       cx="56.257618"
       cy="19.887342"
       rx="0.87465733"
       ry="0.82092887"
       style="stroke-width:0.0730126" />
    <ellipse
       id="path28-8-2-5-9-1-7-8-6-2-6-1-7-8-9-1-0"
       cx="66.990532"
       cy="9.8016052"
       rx="0.87465733"
       ry="0.82092887"
       style="stroke-width:0.0730126" />
    <ellipse
       id="path28-8-2-5-9-1-7-8-6-2-6-1-7-8-9-1-0-0"
       cx="59.377224"
       cy="19.306313"
       rx="0.87465733"
       ry="0.82092887"
       style="stroke-width:0.0730126" />
    <ellipse
       id="path28-8-2-5-9-1-7-8-6-2-6-1-7-8-9-1-0-0-2"
       cx="55.610428"
       cy="9.6617584"
       rx="0.87465733"
       ry="0.82092887"
       style="stroke-width:0.0730126" />
    <ellipse
       id="path28-8-2-5-9-1-7-8-6-2-6-1-7-8-9-1-0-0-2-6"
       cx="56.257618"
       cy="17.169146"
       rx="0.87465733"
       ry="0.82092887"
       style="stroke-width:0.0730126" />
    <ellipse
       id="path28-8-2-5-9-1-7-8-6-2-6-1-7-8-9-1-0-0-2-6-7"
       cx="59.542484"
       cy="21.475378"
       rx="0.87465733"
       ry="0.82092887"
       style="stroke-width:0.0730126" />
    <ellipse
       id="path28-8-2-5-9-1-7-8-6-2-6-1-7-8-9-1-0-0-2-6-7-1"
       cx="68.026039"
       cy="29.465731"
       rx="0.87465733"
       ry="0.82092887"
       style="stroke-width:0.0730126" />
  </g>
  <g
     inkscape:groupmode="layer"
     id="layer2"
     inkscape:label="ChiffresNoirs"
     style="display:inline"
     transform="translate(-8.8926129,-5.6220918)"
     sodipodi:insensitive="true">
    <flowRoot
       xml:space="preserve"
       id="flowRoot360"
       style="font-style:normal;font-weight:normal;font-size:40px;line-height:1.25;font-family:sans-serif;letter-spacing:0px;word-spacing:0px;fill:#000000;fill-opacity:1;stroke:none"
       transform="matrix(0.26458333,0,0,0.26458333,-25.201562,-77.390623)"><flowRegion
         id="flowRegion362"><rect
           id="rect364"
           width="51"
           height="76"
           x="131"
           y="351.51968" /></flowRegion><flowPara
         id="flowPara366"
         style="font-size:5.33333349px">1</flowPara></flowRoot>    <flowRoot
       xml:space="preserve"
       id="flowRoot360-7"
       style="font-style:normal;font-weight:normal;font-size:40px;line-height:1.25;font-family:sans-serif;letter-spacing:0px;word-spacing:0px;fill:#000000;fill-opacity:1;stroke:none"
       transform="matrix(0.26458333,0,0,0.26458333,-25.207763,-88.185025)"><flowRegion
         id="flowRegion362-7"><rect
           id="rect364-1"
           width="51"
           height="76"
           x="131"
           y="351.51968" /></flowRegion><flowPara
         id="flowPara366-1"
         style="font-size:5.33333349px">5</flowPara></flowRoot>    <flowRoot
       xml:space="preserve"
       id="flowRoot360-7-3"
       style="font-style:normal;font-weight:normal;font-size:40px;line-height:1.25;font-family:sans-serif;letter-spacing:0px;word-spacing:0px;fill:#000000;fill-opacity:1;stroke:none"
       transform="matrix(0.26458333,0,0,0.26458333,-25.340055,-95.328775)"><flowRegion
         id="flowRegion362-7-3"><rect
           id="rect364-1-2"
           width="51"
           height="76"
           x="131"
           y="351.51968" /></flowRegion><flowPara
         id="flowPara366-1-6"
         style="font-size:5.33333349px">2</flowPara></flowRoot>    <flowRoot
       xml:space="preserve"
       id="flowRoot360-7-3-0"
       style="font-style:normal;font-weight:normal;font-size:40px;line-height:1.25;font-family:sans-serif;letter-spacing:0px;word-spacing:0px;fill:#000000;fill-opacity:1;stroke:none"
       transform="matrix(0.26458333,0,0,0.26458333,-13.830679,-95.461066)"><flowRegion
         id="flowRegion362-7-3-3"><rect
           id="rect364-1-2-9"
           width="51"
           height="76"
           x="131"
           y="351.51968" /></flowRegion><flowPara
         id="flowPara366-1-6-2"
         style="font-size:5.33333349px">3</flowPara></flowRoot>    <flowRoot
       xml:space="preserve"
       id="flowRoot360-7-3-0-9"
       style="font-style:normal;font-weight:normal;font-size:40px;line-height:1.25;font-family:sans-serif;letter-spacing:0px;word-spacing:0px;fill:#000000;fill-opacity:1;stroke:none"
       transform="matrix(0.26458333,0,0,0.26458333,-13.764533,-87.986587)"><flowRegion
         id="flowRegion362-7-3-3-7"><rect
           id="rect364-1-2-9-9"
           width="51"
           height="76"
           x="131"
           y="351.51968" /></flowRegion><flowPara
         id="flowPara366-1-6-2-9"
         style="font-size:5.33333349px">4</flowPara></flowRoot>    <flowRoot
       xml:space="preserve"
       id="flowRoot360-7-3-0-9-9"
       style="font-style:normal;font-weight:normal;font-size:40px;line-height:1.25;font-family:sans-serif;letter-spacing:0px;word-spacing:0px;display:inline;fill:#000000;fill-opacity:1;stroke:none"
       transform="matrix(0.26458333,0,0,0.26458333,-13.471701,-77.272688)"><flowRegion
         id="flowRegion362-7-3-3-7-7"><rect
           id="rect364-1-2-9-9-4"
           width="51"
           height="76"
           x="131"
           y="351.51968" /></flowRegion><flowPara
         id="flowPara366-1-6-2-9-2"
         style="font-size:5.33333349px">6</flowPara></flowRoot>    <text
       xml:space="preserve"
       style="font-style:normal;font-weight:normal;font-size:10.58333302px;line-height:1.25;font-family:sans-serif;letter-spacing:0px;word-spacing:0px;fill:#000000;fill-opacity:1;stroke:none;stroke-width:0.26458332"
       x="26.722916"
       y="32.813538"
       id="text607"><tspan
         sodipodi:role="line"
         id="tspan605"
         x="26.722916"
         y="42.469032"
         style="stroke-width:0.26458332" /></text>
    <flowRoot
       xml:space="preserve"
       id="flowRoot360-7-3-0-9-9-1"
       style="font-style:normal;font-weight:normal;font-size:40px;line-height:1.25;font-family:sans-serif;letter-spacing:0px;word-spacing:0px;display:inline;fill:#000000;fill-opacity:1;stroke:none"
       transform="matrix(0.26458333,0,0,0.26458333,-6.079904,-76.876846)"><flowRegion
         id="flowRegion362-7-3-3-7-7-7"><rect
           id="rect364-1-2-9-9-4-9"
           width="51"
           height="76"
           x="131"
           y="351.51968" /></flowRegion><flowPara
         id="flowPara366-1-6-2-9-2-4"
         style="font-size:5.33333349px">7</flowPara></flowRoot>    <flowRoot
       xml:space="preserve"
       id="flowRoot360-7-3-0-9-9-6"
       style="font-style:normal;font-weight:normal;font-size:40px;line-height:1.25;font-family:sans-serif;letter-spacing:0px;word-spacing:0px;display:inline;fill:#000000;fill-opacity:1;stroke:none"
       transform="matrix(0.26458333,0,0,0.26458333,-6.2121957,-86.071117)"><flowRegion
         id="flowRegion362-7-3-3-7-7-3"><rect
           id="rect364-1-2-9-9-4-5"
           width="51"
           height="76"
           x="131"
           y="351.51968" /></flowRegion><flowPara
         id="flowPara366-1-6-2-9-2-9"
         style="font-size:5.33333349px">8</flowPara></flowRoot>    <flowRoot
       xml:space="preserve"
       id="flowRoot360-7-3-0-9-9-9"
       style="font-style:normal;font-weight:normal;font-size:40px;line-height:1.25;font-family:sans-serif;letter-spacing:0px;word-spacing:0px;display:inline;fill:#000000;fill-opacity:1;stroke:none"
       transform="matrix(0.26458333,0,0,0.26458333,-6.8075082,-95.992992)"><flowRegion
         id="flowRegion362-7-3-3-7-7-5"><rect
           id="rect364-1-2-9-9-4-6"
           width="51"
           height="76"
           x="131"
           y="351.51968" /></flowRegion><flowPara
         id="flowPara366-1-6-2-9-2-7"
         style="font-size:5.33333349px">9</flowPara></flowRoot>    <flowRoot
       xml:space="preserve"
       id="flowRoot360-7-3-0-9-9-91"
       style="font-style:normal;font-weight:normal;font-size:40px;line-height:1.25;font-family:sans-serif;letter-spacing:0px;word-spacing:0px;display:inline;fill:#000000;fill-opacity:1;stroke:none"
       transform="matrix(0.26458333,0,0,0.26458333,-0.92052901,-91.230492)"><flowRegion
         id="flowRegion362-7-3-3-7-7-39"><rect
           id="rect364-1-2-9-9-4-55"
           width="51"
           height="76"
           x="131"
           y="351.51968" /></flowRegion><flowPara
         id="flowPara366-1-6-2-9-2-3"
         style="font-size:5.33333349px">10</flowPara></flowRoot>    <flowRoot
       xml:space="preserve"
       id="flowRoot360-7-3-0-9-9-0"
       style="font-style:normal;font-weight:normal;font-size:40px;line-height:1.25;font-family:sans-serif;letter-spacing:0px;word-spacing:0px;display:inline;fill:#000000;fill-opacity:1;stroke:none"
       transform="matrix(0.26458333,0,0,0.26458333,4.3049918,-84.483617)"><flowRegion
         id="flowRegion362-7-3-3-7-7-9"><rect
           id="rect364-1-2-9-9-4-8"
           width="51"
           height="76"
           x="131"
           y="351.51968" /></flowRegion><flowPara
         id="flowPara366-1-6-2-9-2-6"
         style="font-size:5.33333349px">11</flowPara></flowRoot>    <flowRoot
       xml:space="preserve"
       id="flowRoot360-7-3-0-9-9-4"
       style="font-style:normal;font-weight:normal;font-size:40px;line-height:1.25;font-family:sans-serif;letter-spacing:0px;word-spacing:0px;display:inline;fill:#000000;fill-opacity:1;stroke:none"
       transform="matrix(0.26458333,0,0,0.26458333,7.4138459,-88.71695)"><flowRegion
         id="flowRegion362-7-3-3-7-7-32"><rect
           id="rect364-1-2-9-9-4-3"
           width="51"
           height="76"
           x="131"
           y="351.51968" /></flowRegion><flowPara
         id="flowPara366-1-6-2-9-2-8"
         style="font-size:5.33333349px">12</flowPara></flowRoot>    <flowRoot
       xml:space="preserve"
       id="flowRoot360-7-3-0-9-9-41"
       style="font-style:normal;font-weight:normal;font-size:40px;line-height:1.25;font-family:sans-serif;letter-spacing:0px;word-spacing:0px;display:inline;fill:#000000;fill-opacity:1;stroke:none"
       transform="matrix(0.26458333,0,0,0.26458333,11.713325,-95.397679)"><flowRegion
         id="flowRegion362-7-3-3-7-7-77"><rect
           id="rect364-1-2-9-9-4-1"
           width="51"
           height="76"
           x="131"
           y="351.51968" /></flowRegion><flowPara
         id="flowPara366-1-6-2-9-2-5"
         style="font-size:5.33333349px">13</flowPara></flowRoot>    <flowRoot
       xml:space="preserve"
       id="flowRoot360-7-3-0-9-9-2"
       style="font-style:normal;font-weight:normal;font-size:40px;line-height:1.25;font-family:sans-serif;letter-spacing:0px;word-spacing:0px;display:inline;fill:#000000;fill-opacity:1;stroke:none"
       transform="matrix(0.26458333,0,0,0.26458333,12.90395,-75.55393)"><flowRegion
         id="flowRegion362-7-3-3-7-7-4"><rect
           id="rect364-1-2-9-9-4-7"
           width="51"
           height="76"
           x="131"
           y="351.51968" /></flowRegion><flowPara
         id="flowPara366-1-6-2-9-2-2"
         style="font-size:5.33333349px">14</flowPara></flowRoot>    <flowRoot
       xml:space="preserve"
       id="flowRoot360-7-3-0-9-9-7"
       style="font-style:normal;font-weight:normal;font-size:40px;line-height:1.25;font-family:sans-serif;letter-spacing:0px;word-spacing:0px;display:inline;fill:#000000;fill-opacity:1;stroke:none"
       transform="matrix(0.26458333,0,0,0.26458333,20.246138,-74.892471)"><flowRegion
         id="flowRegion362-7-3-3-7-7-70"><rect
           id="rect364-1-2-9-9-4-97"
           width="51"
           height="76"
           x="131"
           y="351.51968" /></flowRegion><flowPara
         id="flowPara366-1-6-2-9-2-31"
         style="font-size:5.33333349px">15</flowPara></flowRoot>    <flowRoot
       xml:space="preserve"
       id="flowRoot360-7-3-0-9-9-96"
       style="font-style:normal;font-weight:normal;font-size:40px;line-height:1.25;font-family:sans-serif;letter-spacing:0px;word-spacing:0px;display:inline;fill:#000000;fill-opacity:1;stroke:none"
       transform="matrix(0.26458333,0,0,0.26458333,20.709158,-80.514867)"><flowRegion
         id="flowRegion362-7-3-3-7-7-91"><rect
           id="rect364-1-2-9-9-4-2"
           width="51"
           height="76"
           x="131"
           y="351.51968" /></flowRegion><flowPara
         id="flowPara366-1-6-2-9-2-87"
         style="font-size:5.33333349px">16</flowPara></flowRoot>    <flowRoot
       xml:space="preserve"
       id="flowRoot360-7-3-0-9-9-11"
       style="font-style:normal;font-weight:normal;font-size:40px;line-height:1.25;font-family:sans-serif;letter-spacing:0px;word-spacing:0px;display:inline;fill:#000000;fill-opacity:1;stroke:none"
       transform="matrix(0.26458333,0,0,0.26458333,32.020096,-94.207055)"><flowRegion
         id="flowRegion362-7-3-3-7-7-326"><rect
           id="rect364-1-2-9-9-4-67"
           width="51"
           height="76"
           x="131"
           y="351.51968" /></flowRegion><flowPara
         id="flowPara366-1-6-2-9-2-45"
         style="font-size:5.33333349px">17</flowPara></flowRoot>    <flowRoot
       xml:space="preserve"
       id="flowRoot360-7-3-0-9-9-29"
       style="font-style:normal;font-weight:normal;font-size:40px;line-height:1.25;font-family:sans-serif;letter-spacing:0px;word-spacing:0px;display:inline;fill:#000000;fill-opacity:1;stroke:none"
       transform="matrix(0.26458333,0,0,0.26458333,23.842658,-84.743499)"><flowRegion
         id="flowRegion362-7-3-3-7-7-1"><rect
           id="rect364-1-2-9-9-4-0"
           width="51"
           height="76"
           x="131"
           y="351.51968" /></flowRegion><flowPara
         id="flowPara366-1-6-2-9-2-52"
         style="font-size:5.33333349px">18</flowPara></flowRoot>    <flowRoot
       xml:space="preserve"
       id="flowRoot360-7-3-0-9-9-29-9"
       style="font-style:normal;font-weight:normal;font-size:40px;line-height:1.25;font-family:sans-serif;letter-spacing:0px;word-spacing:0px;display:inline;fill:#000000;fill-opacity:1;stroke:none"
       transform="matrix(0.26458333,0,0,0.26458333,20.545861,-86.92998)"><flowRegion
         id="flowRegion362-7-3-3-7-7-1-6"><rect
           id="rect364-1-2-9-9-4-0-3"
           width="51"
           height="76"
           x="131"
           y="351.51968" /></flowRegion><flowPara
         id="flowPara366-1-6-2-9-2-52-8"
         style="font-size:5.33333349px">19</flowPara></flowRoot>    <flowRoot
       xml:space="preserve"
       id="flowRoot360-7-3-0-9-9-29-9-3"
       style="font-style:normal;font-weight:normal;font-size:40px;line-height:1.25;font-family:sans-serif;letter-spacing:0px;word-spacing:0px;display:inline;fill:#000000;fill-opacity:1;stroke:none"
       transform="matrix(0.26458333,0,0,0.26458333,32.655028,-74.692656)"><flowRegion
         id="flowRegion362-7-3-3-7-7-1-6-9"><rect
           id="rect364-1-2-9-9-4-0-3-7"
           width="51"
           height="76"
           x="131"
           y="351.51968" /></flowRegion><flowPara
         id="flowPara366-1-6-2-9-2-52-8-3"
         style="font-size:5.33333349px">20</flowPara></flowRoot>    <flowRoot
       xml:space="preserve"
       id="flowRoot360-7-3-0-9-9-29-9-8"
       style="font-style:normal;font-weight:normal;font-size:40px;line-height:1.25;font-family:sans-serif;letter-spacing:0px;word-spacing:0px;display:inline;fill:#000000;fill-opacity:1;stroke:none"
       transform="matrix(0.26458333,0,0,0.26458333,23.993818,-79.264173)"><flowRegion
         id="flowRegion362-7-3-3-7-7-1-6-6"><rect
           id="rect364-1-2-9-9-4-0-3-2"
           width="51"
           height="76"
           x="131"
           y="351.51968" /></flowRegion><flowPara
         id="flowPara366-1-6-2-9-2-52-8-7"
         style="font-size:5.33333349px">21</flowPara></flowRoot>    <flowRoot
       xml:space="preserve"
       id="flowRoot360-7-3-0-9-9-29-9-1"
       style="font-style:normal;font-weight:normal;font-size:40px;line-height:1.25;font-family:sans-serif;letter-spacing:0px;word-spacing:0px;display:inline;fill:#000000;fill-opacity:1;stroke:none"
       transform="matrix(0.26458333,0,0,0.26458333,20.153465,-94.668698)"><flowRegion
         id="flowRegion362-7-3-3-7-7-1-6-91"><rect
           id="rect364-1-2-9-9-4-0-3-0"
           width="51"
           height="76"
           x="131"
           y="351.51968" /></flowRegion><flowPara
         id="flowPara366-1-6-2-9-2-52-8-5"
         style="font-size:5.33333349px">22</flowPara></flowRoot>  </g>
  <g
     inkscape:groupmode="layer"
     id="layer4"
     inkscape:label="ChiffresRouges"
     transform="translate(-8.8926129,-5.6220918)"
     sodipodi:insensitive="true">
    <flowRoot
       xml:space="preserve"
       id="flowRoot360-0"
       style="font-style:normal;font-weight:normal;font-size:40px;line-height:1.25;font-family:sans-serif;letter-spacing:0px;word-spacing:0px;display:inline;fill:#000000;fill-opacity:1;stroke:none"
       transform="matrix(0.26458333,0,0,0.26458333,-23.670457,-80.120579)"><flowRegion
         id="flowRegion362-1"><rect
           id="rect364-11"
           width="51"
           height="76"
           x="131"
           y="351.51968" /></flowRegion><flowPara
         id="flowPara366-8"
         style="font-size:5.33333349px;fill:#ff0000">1</flowPara></flowRoot>    <flowRoot
       xml:space="preserve"
       id="flowRoot360-0-8"
       style="font-style:normal;font-weight:normal;font-size:40px;line-height:1.25;font-family:sans-serif;letter-spacing:0px;word-spacing:0px;display:inline;fill:#000000;fill-opacity:1;stroke:none"
       transform="matrix(0.26458333,0,0,0.26458333,-23.343052,-90.597545)"><flowRegion
         id="flowRegion362-1-5"><rect
           id="rect364-11-9"
           width="51"
           height="76"
           x="131"
           y="351.51968" /></flowRegion><flowPara
         id="flowPara366-8-6"
         style="font-size:5.33333349px;fill:#ff0000">2</flowPara></flowRoot>    <flowRoot
       xml:space="preserve"
       id="flowRoot360-0-8-8"
       style="font-style:normal;font-weight:normal;font-size:40px;line-height:1.25;font-family:sans-serif;letter-spacing:0px;word-spacing:0px;display:inline;fill:#000000;fill-opacity:1;stroke:none"
       transform="matrix(0.26458333,0,0,0.26458333,-17.204875,-94.891627)"><flowRegion
         id="flowRegion362-1-5-1"><rect
           id="rect364-11-9-8"
           width="51"
           height="76"
           x="131"
           y="351.51968" /></flowRegion><flowPara
         id="flowPara366-8-6-4"
         style="font-size:5.33333349px;fill:#ff0000">3</flowPara></flowRoot>    <flowRoot
       xml:space="preserve"
       id="flowRoot360-0-8-9"
       style="font-style:normal;font-weight:normal;font-size:40px;line-height:1.25;font-family:sans-serif;letter-spacing:0px;word-spacing:0px;display:inline;fill:#000000;fill-opacity:1;stroke:none"
       transform="matrix(0.26458333,0,0,0.26458333,-17.251646,-86.425864)"><flowRegion
         id="flowRegion362-1-5-6"><rect
           id="rect364-11-9-1"
           width="51"
           height="76"
           x="131"
           y="351.51968" /></flowRegion><flowPara
         id="flowPara366-8-6-2"
         style="font-size:5.33333349px;fill:#ff0000">4</flowPara></flowRoot>    <flowRoot
       xml:space="preserve"
       id="flowRoot360-0-8-8-7"
       style="font-style:normal;font-weight:normal;font-size:40px;line-height:1.25;font-family:sans-serif;letter-spacing:0px;word-spacing:0px;display:inline;fill:#000000;fill-opacity:1;stroke:none"
       transform="matrix(0.26458333,0,0,0.26458333,-17.340023,-76.66116)"><flowRegion
         id="flowRegion362-1-5-1-1"><rect
           id="rect364-11-9-8-6"
           width="51"
           height="76"
           x="131"
           y="351.51968" /></flowRegion><flowPara
         id="flowPara366-8-6-4-0"
         style="font-size:5.33333349px;fill:#ff0000">5</flowPara></flowRoot>    <flowRoot
       xml:space="preserve"
       id="flowRoot360-0-8-8-1"
       style="font-style:normal;font-weight:normal;font-size:40px;line-height:1.25;font-family:sans-serif;letter-spacing:0px;word-spacing:0px;display:inline;fill:#000000;fill-opacity:1;stroke:none"
       transform="matrix(0.26458333,0,0,0.26458333,-8.9210327,-75.35154)"><flowRegion
         id="flowRegion362-1-5-1-9"><rect
           id="rect364-11-9-8-2"
           width="51"
           height="76"
           x="131"
           y="351.51968" /></flowRegion><flowPara
         id="flowPara366-8-6-4-5"
         style="font-size:5.33333349px;fill:#ff0000">6</flowPara></flowRoot>    <flowRoot
       xml:space="preserve"
       id="flowRoot360-0-8-8-6"
       style="font-style:normal;font-weight:normal;font-size:40px;line-height:1.25;font-family:sans-serif;letter-spacing:0px;word-spacing:0px;display:inline;fill:#000000;fill-opacity:1;stroke:none"
       transform="matrix(0.26458333,0,0,0.26458333,-12.335401,-90.178317)"><flowRegion
         id="flowRegion362-1-5-1-4"><rect
           id="rect364-11-9-8-0"
           width="51"
           height="76"
           x="131"
           y="351.51968" /></flowRegion><flowPara
         id="flowPara366-8-6-4-1"
         style="font-size:5.33333349px;fill:#ff0000">7</flowPara></flowRoot>    <flowRoot
       xml:space="preserve"
       id="flowRoot360-0-8-8-3"
       style="font-style:normal;font-weight:normal;font-size:40px;line-height:1.25;font-family:sans-serif;letter-spacing:0px;word-spacing:0px;display:inline;fill:#000000;fill-opacity:1;stroke:none"
       transform="matrix(0.26458333,0,0,0.26458333,-1.0165362,-94.34104)"><flowRegion
         id="flowRegion362-1-5-1-95"><rect
           id="rect364-11-9-8-22"
           width="51"
           height="76"
           x="131"
           y="351.51968" /></flowRegion><flowPara
         id="flowPara366-8-6-4-50"
         style="font-size:5.33333349px;fill:#ff0000">9</flowPara></flowRoot>    <flowRoot
       xml:space="preserve"
       id="flowRoot360-0-8-8-0"
       style="font-style:normal;font-weight:normal;font-size:40px;line-height:1.25;font-family:sans-serif;letter-spacing:0px;word-spacing:0px;display:inline;fill:#000000;fill-opacity:1;stroke:none"
       transform="matrix(0.26458333,0,0,0.26458333,-0.96976412,-83.957619)"><flowRegion
         id="flowRegion362-1-5-1-97"><rect
           id="rect364-11-9-8-29"
           width="51"
           height="76"
           x="131"
           y="351.51968" /></flowRegion><flowPara
         id="flowPara366-8-6-4-19"
         style="font-size:5.33333349px;fill:#ff0000">10</flowPara></flowRoot>    <flowRoot
       xml:space="preserve"
       id="flowRoot360-0-8-8-33"
       style="font-style:normal;font-weight:normal;font-size:40px;line-height:1.25;font-family:sans-serif;letter-spacing:0px;word-spacing:0px;display:inline;fill:#000000;fill-opacity:1;stroke:none"
       transform="matrix(0.26458333,0,0,0.26458333,-0.59558679,-75.024135)"><flowRegion
         id="flowRegion362-1-5-1-92"><rect
           id="rect364-11-9-8-60"
           width="51"
           height="76"
           x="131"
           y="351.51968" /></flowRegion><flowPara
         id="flowPara366-8-6-4-8"
         style="font-size:5.33333349px;fill:#ff0000">11</flowPara></flowRoot>    <flowRoot
       xml:space="preserve"
       id="flowRoot360-0-8-8-2"
       style="font-style:normal;font-weight:normal;font-size:40px;line-height:1.25;font-family:sans-serif;letter-spacing:0px;word-spacing:0px;display:inline;fill:#000000;fill-opacity:1;stroke:none"
       transform="matrix(0.26458333,0,0,0.26458333,6.4202384,-93.592685)"><flowRegion
         id="flowRegion362-1-5-1-5"><rect
           id="rect364-11-9-8-3"
           width="51"
           height="76"
           x="131"
           y="351.51968" /></flowRegion><flowPara
         id="flowPara366-8-6-4-51"
         style="font-size:5.33333349px;fill:#ff0000">12</flowPara></flowRoot>    <flowRoot
       xml:space="preserve"
       id="flowRoot360-0-8-8-02"
       style="font-style:normal;font-weight:normal;font-size:40px;line-height:1.25;font-family:sans-serif;letter-spacing:0px;word-spacing:0px;display:inline;fill:#000000;fill-opacity:1;stroke:none"
       transform="matrix(0.26458333,0,0,0.26458333,6.7008714,-78.298187)"><flowRegion
         id="flowRegion362-1-5-1-7"><rect
           id="rect364-11-9-8-9"
           width="51"
           height="76"
           x="131"
           y="351.51968" /></flowRegion><flowPara
         id="flowPara366-8-6-4-10"
         style="font-size:5.33333349px;fill:#ff0000">13</flowPara></flowRoot>    <flowRoot
       xml:space="preserve"
       id="flowRoot360-0-8-8-70"
       style="font-style:normal;font-weight:normal;font-size:40px;line-height:1.25;font-family:sans-serif;letter-spacing:0px;word-spacing:0px;display:inline;fill:#000000;fill-opacity:1;stroke:none"
       transform="matrix(0.26458333,0,0,0.26458333,10.816822,-83.209264)"><flowRegion
         id="flowRegion362-1-5-1-19"><rect
           id="rect364-11-9-8-5"
           width="51"
           height="76"
           x="131"
           y="351.51968" /></flowRegion><flowPara
         id="flowPara366-8-6-4-7"
         style="font-size:5.33333349px;fill:#ff0000">14</flowPara></flowRoot>    <flowRoot
       xml:space="preserve"
       id="flowRoot360-0-8-8-9"
       style="font-style:normal;font-weight:normal;font-size:40px;line-height:1.25;font-family:sans-serif;letter-spacing:0px;word-spacing:0px;display:inline;fill:#000000;fill-opacity:1;stroke:none"
       transform="matrix(0.26458333,0,0,0.26458333,14.277963,-77.830464)"><flowRegion
         id="flowRegion362-1-5-1-52"><rect
           id="rect364-11-9-8-04"
           width="51"
           height="76"
           x="131"
           y="351.51968" /></flowRegion><flowPara
         id="flowPara366-8-6-4-4"
         style="font-size:5.33333349px;fill:#ff0000">15</flowPara></flowRoot>    <flowRoot
       xml:space="preserve"
       id="flowRoot360-0-8-8-98"
       style="font-style:normal;font-weight:normal;font-size:40px;line-height:1.25;font-family:sans-serif;letter-spacing:0px;word-spacing:0px;display:inline;fill:#000000;fill-opacity:1;stroke:none"
       transform="matrix(0.26458333,0,0,0.26458333,18.11328,-73.200021)"><flowRegion
         id="flowRegion362-1-5-1-72"><rect
           id="rect364-11-9-8-7"
           width="51"
           height="76"
           x="131"
           y="351.51968" /></flowRegion><flowPara
         id="flowPara366-8-6-4-3"
         style="font-size:5.33333349px;fill:#ff0000">16</flowPara></flowRoot>    <flowRoot
       xml:space="preserve"
       id="flowRoot360-0-8-8-69"
       style="font-style:normal;font-weight:normal;font-size:40px;line-height:1.25;font-family:sans-serif;letter-spacing:0px;word-spacing:0px;display:inline;fill:#000000;fill-opacity:1;stroke:none"
       transform="matrix(0.26458333,0,0,0.26458333,17.271381,-93.124964)"><flowRegion
         id="flowRegion362-1-5-1-51"><rect
           id="rect364-11-9-8-223"
           width="51"
           height="76"
           x="131"
           y="351.51968" /></flowRegion><flowPara
         id="flowPara366-8-6-4-08"
         style="font-size:5.33333349px;fill:#ff0000">17</flowPara></flowRoot>    <flowRoot
       xml:space="preserve"
       id="flowRoot360-0-8-8-65"
       style="font-style:normal;font-weight:normal;font-size:40px;line-height:1.25;font-family:sans-serif;letter-spacing:0px;word-spacing:0px;display:inline;fill:#000000;fill-opacity:1;stroke:none"
       transform="matrix(0.26458333,0,0,0.26458333,22.369548,-89.196101)"><flowRegion
         id="flowRegion362-1-5-1-190"><rect
           id="rect364-11-9-8-4"
           width="51"
           height="76"
           x="131"
           y="351.51968" /></flowRegion><flowPara
         id="flowPara366-8-6-4-82"
         style="font-size:5.33333349px;fill:#ff0000">18</flowPara></flowRoot>    <flowRoot
       xml:space="preserve"
       id="flowRoot360-0-8-8-18"
       style="font-style:normal;font-weight:normal;font-size:40px;line-height:1.25;font-family:sans-serif;letter-spacing:0px;word-spacing:0px;display:inline;fill:#000000;fill-opacity:1;stroke:none"
       transform="matrix(0.26458333,0,0,0.26458333,28.262841,-81.151289)"><flowRegion
         id="flowRegion362-1-5-1-8"><rect
           id="rect364-11-9-8-35"
           width="51"
           height="76"
           x="131"
           y="351.51968" /></flowRegion><flowPara
         id="flowPara366-8-6-4-79"
         style="font-size:5.33333349px;fill:#ff0000">19</flowPara></flowRoot>    <flowRoot
       xml:space="preserve"
       id="flowRoot360-0-8-8-18-3"
       style="font-style:normal;font-weight:normal;font-size:40px;line-height:1.25;font-family:sans-serif;letter-spacing:0px;word-spacing:0px;display:inline;fill:#000000;fill-opacity:1;stroke:none"
       transform="matrix(0.26458333,0,0,0.26458333,22.95128,-78.110753)"><flowRegion
         id="flowRegion362-1-5-1-8-1"><rect
           id="rect364-11-9-8-35-5"
           width="51"
           height="76"
           x="131"
           y="351.51968" /></flowRegion><flowPara
         id="flowPara366-8-6-4-79-3"
         style="font-size:5.33333349px;fill:#ff0000">20</flowPara></flowRoot>    <flowRoot
       xml:space="preserve"
       id="flowRoot360-0-8-8-18-3-9"
       style="font-style:normal;font-weight:normal;font-size:40px;line-height:1.25;font-family:sans-serif;letter-spacing:0px;word-spacing:0px;display:inline;fill:#000000;fill-opacity:1;stroke:none"
       transform="matrix(0.26458333,0,0,0.26458333,27.902666,-72.919387)"><flowRegion
         id="flowRegion362-1-5-1-8-1-0"><rect
           id="rect364-11-9-8-35-5-3"
           width="51"
           height="76"
           x="131"
           y="351.51968" /></flowRegion><flowPara
         id="flowPara366-8-6-4-79-3-2"
         style="font-size:5.33333349px;fill:#ff0000">21</flowPara></flowRoot>    <flowRoot
       xml:space="preserve"
       id="flowRoot360-0-8-8-18-3-9-4"
       style="font-style:normal;font-weight:normal;font-size:40px;line-height:1.25;font-family:sans-serif;letter-spacing:0px;word-spacing:0px;display:inline;fill:#000000;fill-opacity:1;stroke:none"
       transform="matrix(0.26458333,0,0,0.26458333,34.61968,-77.49238)"><flowRegion
         id="flowRegion362-1-5-1-8-1-0-6"><rect
           id="rect364-11-9-8-35-5-3-1"
           width="51"
           height="76"
           x="131"
           y="351.51968" /></flowRegion><flowPara
         id="flowPara366-8-6-4-79-3-2-2"
         style="font-size:5.33333349px;fill:#ff0000">22</flowPara></flowRoot>    <flowRoot
       xml:space="preserve"
       id="flowRoot360-0-8-8-18-3-9-4-6"
       style="font-style:normal;font-weight:normal;font-size:40px;line-height:1.25;font-family:sans-serif;letter-spacing:0px;word-spacing:0px;display:inline;fill:#000000;fill-opacity:1;stroke:none"
       transform="matrix(0.26458333,0,0,0.26458333,26.872989,-92.786879)"><flowRegion
         id="flowRegion362-1-5-1-8-1-0-6-2"><rect
           id="rect364-11-9-8-35-5-3-1-6"
           width="51"
           height="76"
           x="131"
           y="351.51968" /></flowRegion><flowPara
         id="flowPara366-8-6-4-79-3-2-2-5"
         style="font-size:5.33333349px;fill:#ff0000">23</flowPara></flowRoot>    <flowRoot
       xml:space="preserve"
       id="flowRoot360-0-8-8-6-3"
       style="font-style:normal;font-weight:normal;font-size:40px;line-height:1.25;font-family:sans-serif;letter-spacing:0px;word-spacing:0px;display:inline;fill:#000000;fill-opacity:1;stroke:none"
       transform="matrix(0.26458333,0,0,0.26458333,-5.6536132,-89.32457)"><flowRegion
         id="flowRegion362-1-5-1-4-7"><rect
           id="rect364-11-9-8-0-5"
           width="51"
           height="76"
           x="131"
           y="351.51968" /></flowRegion><flowPara
         id="flowPara366-8-6-4-1-6"
         style="font-size:5.33333349px;fill:#ff0000">8</flowPara></flowRoot>  </g>
  <g
     inkscape:groupmode="layer"
     id="layer5"
     inkscape:label="CALQUE" />
</svg>
