{
  "$schema": "https://schema.management.azure.com/schemas/2015-01-01/deploymentTemplate.json#",
  "contentVersion": "1.0.0.0",
  "parameters": {
    "location": {
      "type": "string",
      "defaultValue": "[resourceGroup().location]",
      "metadata": {
        "description": "Location for all resources."
      }
    },
    "virtualNetworkSettings": {
      "type": "array",
      "metadata": {
        "description": "Defined settings for Virtual Networks"
      }
    },
  },
  "variables": {
      "copy": [
        {
          "name": "virtualNetworkOuput",
          "count": "[length(parameters('virtualNetworkSettings'))]",
          "input": {
            "id": "[resourceId('Microsoft.Network/virtualNetworks', parameters('virtualNetworkSettings')[copyIndex('virtualNetworkOuput')].name)]"
          }
        }
      ]
  },
  "resources": [
    {
      "type": "Microsoft.Network/virtualNetworks",
      "apiVersion": "2019-11-01",
      "name": "[parameters('virtualNetworkSettings')[copyIndex('virtualNetworkCopy')].name]",
      "location": "[parameters('location')]",
      /*"dependsOn": [
        "[resourceId('Microsoft.Network/networkSecurityGroups', variables('networkSecurityGroupName'))]"
        "[reference('ClouderaCluster-NetworkSecurityGroups').outputs.]"
      ],*/
      "copy": {
        "name": "virtualNetworkCopy",
        "count": "[length(parameters('virtualNetworkSettings'))]"
      },
      "properties": {
        "addressSpace": {
          "addressPrefixes": "[parameters('virtualNetworkSettings')[copyIndex('virtualNetworkCopy')].addressPrefixes]"
        },
        "subnets": [
          {
            "name": "[parameters('virtualNetworkSettings')[copyIndex('virtualNetworkCopy')].subnets[0].name]",
            "properties": {
              "addressPrefix": "[parameters('virtualNetworkSettings')[copyIndex('virtualNetworkCopy')].subnets[0].addressPrefix]",
              "networkSecurityGroup": {
                "id": "[resourceId('Microsoft.Network/networkSecurityGroups', parameters('virtualNetworkSettings')[copyIndex('virtualNetworkCopy')].subnets[0].networkSecurityGroup)]"
              }
            }
          },
          {
            "name": "[parameters('virtualNetworkSettings')[copyIndex('virtualNetworkCopy')].subnets[1].name]",
            "properties": {
              "addressPrefix": "[parameters('virtualNetworkSettings')[copyIndex('virtualNetworkCopy')].subnets[1].addressPrefix]",
              "networkSecurityGroup": {
                "id": "[resourceId('Microsoft.Network/networkSecurityGroups', parameters('virtualNetworkSettings')[copyIndex('virtualNetworkCopy')].subnets[1].networkSecurityGroup)]"
              }
            }
          },
          {
            "name": "[parameters('virtualNetworkSettings')[copyIndex('virtualNetworkCopy')].subnets[2].name]",
            "properties": {
              "addressPrefix": "[parameters('virtualNetworkSettings')[copyIndex('virtualNetworkCopy')].subnets[2].addressPrefix]",
              "networkSecurityGroup": {
                "id": "[resourceId('Microsoft.Network/networkSecurityGroups', parameters('virtualNetworkSettings')[copyIndex('virtualNetworkCopy')].subnets[2].networkSecurityGroup)]"
              }
            }
          }
        ]
      }
    }
  ],
  "outputs": {
    "virtualNetworks": {
      "type": "array",
      "value": "[variables('virtualNetworkOuput')]"
    }
  }
}