{
    "colors": {
        "grey900": "#26292b",
        "black": "#000000",
        "grey800": "#787f85",
        "grey700": "#959da3",
        "grey600": "#acb3b9",
        "grey500": "#c1c6cb",
        "grey400": "#cdd2d7",
        "grey300": "#dadee2",
        "grey100": "#f7f9fb",
        "white": "#ffffff",
        "grey200": "#eef0f4",
        "fade": "rgba(46, 62, 81, 0.5)",
        "primary": "#0d7ad9",
        "primaryHover": "#175098",
        "secondary": "#8095af",
        "secondaryHover": "#2e3e51",
        "dark": "#242e3a",
        "danger": "#e04d3f",
        "dangerBg": "#fae4e2",
        "dangerDivider": "#f4bdb8",
        "warning": "#f1a31d",
        "warningBg": "#fdf1de",
        "warningDivider": "#faddab",
        "success": "#42a742",
        "successBg": "#e3f2e3",
        "successDivider": "#b9deb9",
        "lightBlue": "#dbebf9",
        "link": "#0d7ad9",
        "infoBg": "#dcebf8",
        "infoDivider": "#a6cef1"
    },
    "shadows": {
        "small": "1px 1px 3px rgba(51, 51, 51, 0.03), 0 3px 9px rgba(51, 51, 51, 0.08)",
        "big": "4px 10px 35px rgba(18, 19, 20, 0.08)",
        "bigInversion": "0 -10px 35px rgba(51, 51, 51, 0.08)",
        "inner": "inset 3px 3px 10px rgba(51, 51, 51, 0.1), inset 0 0 3px rgba(51, 51, 51, 0.1)"
    },
    "typography": {
        "breakpoints": [1440, 768],
        "styles": {
            "button": {
                "desktop": { "fontFamily": "Arial", "fontWeight": 400, "fontSize": "0.875rem", "lineHeight": 1.1 }
            },
            "buttonBold": {
                "desktop": { "fontFamily": "Arial", "fontWeight": 700, "fontSize": "0.875rem", "lineHeight": 1.1 }
            },
            "caption": {
                "desktop": {
                    "fontFamily": "Arial",
                    "fontWeight": 400,
                    "fontSize": "0.6875rem",
                    "lineHeight": 1.2,
                    "letterSpacing": "0.08em",
                    "textTransform": "uppercase"
                }
            },
            "captionBold": {
                "desktop": {
                    "fontFamily": "Arial",
                    "fontWeight": 700,
                    "fontSize": "0.6875rem",
                    "lineHeight": 1.2,
                    "letterSpacing": "0.08em",
                    "textTransform": "uppercase"
                }
            },
            "captionBoldLower": {
                "desktop": { "fontFamily": "Arial", "fontWeight": 700, "fontSize": "0.6875rem", "lineHeight": 1.2 }
            },
            "small": {
                "desktop": { "fontFamily": "Arial", "fontWeight": 400, "fontSize": "0.75rem", "lineHeight": 1.3 }
            },
            "smallBold": {
                "desktop": { "fontFamily": "Arial", "fontWeight": 700, "fontSize": "0.75rem", "lineHeight": 1.2 }
            },
            "bodySm": {
                "desktop": { "fontFamily": "Arial", "fontWeight": 400, "fontSize": "0.875rem", "lineHeight": 1.4 }
            },
            "bodySmBold": {
                "desktop": { "fontFamily": "Arial", "fontWeight": 700, "fontSize": "0.875rem", "lineHeight": 1.4 }
            },
            "bodyMdBold": {
                "desktop": {
                    "fontFamily": "Arial",
                    "fontWeight": 700,
                    "fontSize": "1rem",
                    "lineHeight": 1.4,
                    "fontVariantNumeric": "tabular-nums"
                }
            },
            "bodyMd": {
                "desktop": { "fontFamily": "Arial", "fontWeight": 400, "fontSize": "1rem", "lineHeight": 1.4 }
            },
            "subheading": {
                "desktop": { "fontFamily": "Arial", "fontWeight": 400, "fontSize": "1.125rem", "lineHeight": 1.5 }
            },
            "h3": {
                "desktop": { "fontFamily": "Arial", "fontWeight": 700, "fontSize": "1.125rem", "lineHeight": 1.1 }
            },
            "h2": { "desktop": { "fontFamily": "Arial", "fontWeight": 700, "fontSize": "1.25rem", "lineHeight": 1.1 } },
            "h1": { "desktop": { "fontFamily": "Arial", "fontWeight": 700, "fontSize": "1.375rem", "lineHeight": 1.1 } }
        }
    }
}
