{
    "meta": {
        "ts_version": "5.12", 
        "name": "Oncomine Comprehensive v3 - w3.2 - DNA - Single Sample", 
        "tmapargs": "tmap mapall ... -J 25 --end-repair 15 --do-repeat-clip --context stage1 map4", 
        "tooltip": "Detects and annotates low frequency somatic variants (SNPs, InDels, CNVs) from targeted DNA libraries from the Oncomine Comprehensive Assay v3 (using Ion AmpliSeq technology) run on the 540 chip. Released with: Ion Reporter Software 5.10. Workflow Version: 3.2.", 
        "configuration": "germline_low_stringency_530", 
        "compatibility": {
            "chip": [
                "510", 
                "520", 
                "530",
                "540"
            ], 
            "frequency": [
                "solid"
            ], 
            "stringency": [
                "low"
            ], 
            "library": [
                "ampliseq"
            ]
        }
    }, 
    "torrent_variant_caller": {
        "snp_min_allele_freq": 0.025, 
        "snp_strand_bias": 0.9, 
        "hotspot_min_coverage": 15, 
        "try_few_restart_freq": 0, 
        "hotspot_min_cov_each_strand": 2, 
        "indel_min_var_coverage": 2, 
        "prediction_precision": 1.0, 
        "tag_trim_method": "sloppy-trim", 
        "snp_min_variant_score": 10.0, 
        "hotspots_positions_only": 0, 
        "mnp_min_variant_score": 10.0, 
        "downsample_to_coverage": 8000, 
        "indel_min_variant_score": 30.0, 
        "hotspot_strand_bias": 0.96, 
        "hp_max_length": 8, 
        "filter_insertion_predictions": 0.2, 
        "mnp_min_coverage": 20, 
        "indel_min_coverage": 20, 
        "heavy_tailed": 3.0, 
        "outlier_probability": 0.005, 
        "position_bias_ref_fraction": 0.05, 
        "indel_strand_bias_pval": 1.0, 
        "data_quality_stringency": 10.0, 
        "snp_min_cov_each_strand": 3, 
        "indel_as_hpindel": 0, 
        "snp_strand_bias_pval": 1.0, 
        "max_detail_level": 0, 
        "snp_min_coverage": 20, 
        "mnp_strand_bias": 0.9, 
        "lod_multiplier": 0.6, 
        "use_fd_param": 0, 
        "hotspot_min_var_coverage": 2, 
        "mnp_strand_bias_pval": 1.0, 
        "hotspot_strand_bias_pval": 1.0, 
        "hotspot_min_variant_score": 8.0, 
        "sse_prob_threshold": 1.0, 
        "do_mnp_realignment": 0, 
        "indel_strand_bias": 0.85, 
        "position_bias": 0.75, 
        "tag_custom_gene_ruleset": "", 
        "tag_sim_max_cov": 20, 
        "filter_unusual_predictions": 0.25, 
        "indel_min_allele_freq": 0.025, 
        "filter_by_target": 0, 
        "min_detail_level_for_fast_scan": 0, 
        "min_fam_per_strand_cov": 0, 
        "mnp_min_allele_freq": 0.025, 
        "do_snp_realignment": 0, 
        "mnp_min_cov_each_strand": 3, 
        "fd_nonsnp_min_var_cov": 1, 
        "hotspot_min_allele_freq": 0.03, 
        "error_motifs": "", 
        "mnp_min_var_coverage": 2, 
        "use_position_bias": 1, 
        "indel_min_cov_each_strand": 3, 
        "filter_deletion_predictions": 0.2, 
        "min_tag_fam_size": 3, 
        "realignment_threshold": 0.0, 
        "suppress_recalibration": 0, 
        "use_lod_filter": 0, 
        "position_bias_pval": 0.05, 
        "indel_func_size_offset": 2, 
        "snp_min_var_coverage": 2
    }, 
    "long_indel_assembler": {
        "min_indel_size": 4, 
        "output_mnv": 0, 
        "min_var_count": 5, 
        "short_suffix_match": 5, 
        "min_var_freq": 0.07, 
        "kmer_len": 19, 
        "max_hp_length": 8, 
        "relative_strand_bias": 0.8
    }, 
    "freebayes": {
        "gen_min_coverage": 20, 
        "allow_mnps": 1, 
        "allow_complex": 0, 
        "read_max_mismatch_fraction": 1.0, 
        "use_input_allele_only": 0, 
        "allow_snps": 1, 
        "read_snp_limit": 10, 
        "min_cov_fraction": 0.0, 
        "allow_indels": 1, 
        "min_mapping_qv": 4, 
        "gen_min_alt_allele_freq": 0.02, 
        "read_mismatch_limit": 0, 
        "gen_min_indel_alt_allele_freq": 0.02
    }
}
