try enabling ipsepcola by default

10 jobs for master in 16 minutes and 56 seconds (queued for 19 seconds)
Status Job ID Name Coverage
  Source
passed #120034018
graphviz centos7
portable-source

00:01:58

 
  Build
passed #120034020
graphviz centos6
centos6-build

00:09:48

passed #120034021
graphviz centos7
centos7-build

00:13:06

passed #120034023
graphviz fedora27
fedora27-build

00:13:04

passed #120034025
graphviz fedora28
fedora28-build

00:13:42

passed #120034026
graphviz fedora29
fedora29-build

00:13:23

passed #120034027
graphviz fedora30
fedora30-build

00:14:54

failed #120034028
graphviz ubuntu18-04
ubuntu18-04-build

00:09:28

failed #120034029
graphviz ubuntu18-10
ubuntu18-10-build

00:10:01

 
  External
passed continuous-integration/appveyor/branch

 
Name Stage Failure
failed
ubuntu18-10-build Build
make[4]: Leaving directory '/var/lib/gitlab-runner/builds/4a63ecc5/0/graphviz/graphviz/graphviz-2.41.20181113.2005/cmd/mingle'
make[3]: *** [Makefile:563: all-recursive] Error 1
make[3]: Leaving directory '/var/lib/gitlab-runner/builds/4a63ecc5/0/graphviz/graphviz/graphviz-2.41.20181113.2005/cmd'
make[2]: *** [Makefile:813: all-recursive] Error 1
make[2]: Leaving directory '/var/lib/gitlab-runner/builds/4a63ecc5/0/graphviz/graphviz/graphviz-2.41.20181113.2005'
make[1]: *** [Makefile:620: all] Error 2
make[1]: Leaving directory '/var/lib/gitlab-runner/builds/4a63ecc5/0/graphviz/graphviz/graphviz-2.41.20181113.2005'
make: *** [debian/rules:100: build-stamp] Error 2
ERROR: Job failed: exit status 1
failed
ubuntu18-04-build Build
Makefile:813: recipe for target 'all-recursive' failed
make[2]: *** [all-recursive] Error 1
make[2]: Leaving directory '/home/gitlab-runner/builds/ae8d1f36/0/graphviz/graphviz/graphviz-2.41.20181113.2005'
Makefile:620: recipe for target 'all' failed
make[1]: *** [all] Error 2
make[1]: Leaving directory '/home/gitlab-runner/builds/ae8d1f36/0/graphviz/graphviz/graphviz-2.41.20181113.2005'
debian/rules:98: recipe for target 'build-stamp' failed
make: *** [build-stamp] Error 2
ERROR: Job failed: exit status 1